program: Gaussian 09
title: 000228813
version: EM64L-G09RevD.01
frameworkgroup: C1[X(C6H11NO2)]
method: RPBEPBE
basis: SDD
operation: Freq
keyword: #p
keyword: freq=noraman
keyword: PBEPBE/SDD
title: #p freq=noraman PBEPBE/SDD
converged: YES YES NO NO
title: Mulliken charges:
elementType: O O N C C C C C C H H H H H H H H H H H
charge: -0.418702 -0.235034 -0.552622 -0.550443 -0.217448 0.564788 0.180170 -0.827222 -0.739704 0.239640 0.223593 0.260273 0.282506 0.275849 0.226562 0.220978 0.244691 0.226259 0.220465 0.375403
chargesum: 0.00000
title: Mulliken charges with hydrogens summed into heavy atoms:
elementType: O O N C C C C C C
charge: -0.043299 -0.235034 0.005733 -0.087211 0.042826 0.564788 0.180170 -0.134991 -0.292980
polarizability: 7.79646497e+01 -9.21845521e+00 7.53033917e+01 6.51107264e-01 -5.02151262e+00 7.84258469e+01
1716.lowfreq: -15.4084 -0.0008 -0.0004 0.0009 5.3603 10.4345 50.9651 51.7519 74.2815
frequency: 50.8163 51.5421 74.2452 137.0690 184.4680 231.1130 244.9836 265.0538 319.3336 391.8134 411.4934 480.2585 514.3796 595.0967 609.8944 668.3940 692.7597 717.3716 780.9938 826.3726 945.2150 948.1108 969.6063 995.3807 1022.4419 1036.4845 1054.2904 1115.3857 1141.9195 1198.3807 1238.9362 1298.5308 1317.9404 1318.6513 1369.4792 1394.1470 1428.5719 1453.2944 1470.1733 1479.4844 1646.9954 1656.8434 1670.5818 2966.8796 2985.8720 3042.6745 3047.6284 3068.8121 3085.9937 3089.3324 3192.3056 3444.5595 3494.9798 3570.1899
redmass: 8.6410 3.0437 3.6699 2.7659 1.1129 1.8874 3.5250 2.2721 2.0745 2.2068 2.6601 3.0467 2.6985 2.4755 1.3713 1.5982 1.1854 3.1366 3.0804 3.1135 1.4665 1.4442 1.9711 2.0529 1.4596 2.4012 1.6266 2.2460 1.5354 1.3959 1.4822 2.8610 1.6336 1.3304 1.3898 1.2400 1.1634 1.0901 1.0611 1.0649 1.1013 8.1689 4.8623 1.0373 1.0588 1.0973 1.0977 1.0908 1.0971 1.0638 1.1141 1.0450 1.0639 1.0972
irintensity: 1.5479 0.2053 0.2654 0.7622 0.6868 29.4467 0.4544 18.0600 28.5221 1.2052 8.6743 25.4444 3.3653 23.1027 135.1718 254.0726 9.4604 18.1246 4.6942 0.6822 19.3955 44.3320 25.0410 18.9672 8.0295 214.4404 13.4237 21.7397 0.5266 6.2018 3.2817 9.7133 7.4580 1.2795 6.7916 26.7177 1.6739 9.1841 20.6214 16.0422 46.0758 176.5373 34.6111 24.6484 17.1960 12.7771 12.1714 29.0164 29.9180 3.7106 23.3798 1.4081 13.1699 3.2734
temp: 298.150 k
press: 1.00000 atm
elementType: 8 8 7 6 6 6 6 6 6 1 1 1 1 1 1 1 1 1 1 1
symmnumber: 1
zpe: 433093.2 jmol-1
zpe.correction: 0.164956 hartree
zpe.thermalcorrener: 0.175668 hartree
zpe.thermalcorrenthalpy: 0.176613 hartree
zpe.thermalcorrgfe: 0.128350 hartree
zpe.sumelectzpe: -439.699175 hartree
zpe.sumelectthermal: -439.688463 hartree
zpe.sumelectthermalent: -439.687518 hartree
zpe.sumelectthermalfe: -439.735781 hartree
dipole: -0.0108 -0.4398 -1.4346
dipole: 1.5005
quadrupole: -52.9663 -53.7775 -55.8097
quadrupole: -2.0189 2.4155 2.2235
quadrupole: 1.2182 0.4070 -1.6252 -2.0189 2.4155 2.2235
hfenergy: -439.864131 hartree
pointgroup: C01 [X(C6H11N1O2)]
dipole: 0.0114188 0.1504419 -0.5707488 debye
dipolederiv: -0.4442566 0.0849669 -0.0731888 0.1645873 -0.6457827 0.5200309 -0.1244887 0.432503 -0.771484 -0.500932 -0.0761769 -0.2726497 -0.1991861 -0.6285604 -0.1331813 -0.2803199 0.0272809 -0.7400861 -0.5134142 0.020613 -0.0218292 0.0938712 -0.846551 -0.0416336 -0.0313757 -0.0212316 -0.1948258 0.0172614 0.0847032 -0.0179658 0.0484141 0.017736 0.0309148 -0.0075278 -0.0767097 0.0480354 0.3569365 -0.202545 0.013746 -0.1569936 0.2830614 0.0314026 0.0185858 0.040134 0.1532352 0.15978 -0.1244149 0.064294 -0.2326823 0.0546948 0.0983605 0.0815216 0.0906898 0.2879264 0.4267957 0.1070028 0.432391 0.2636518 1.0260854 -0.291707 0.543883 -0.3537394 1.0914286 -0.0137383 0.0402008 -0.0258559 0.0542967 0.059408 0.0022092 -0.0759722 0.0076795 -0.1550311 -0.2213789 -0.1762951 0.1602021 -0.1428721 -0.2945738 -0.0266913 0.137046 -0.0133556 -0.1642703 0.0190193 -0.0502618 0.0097097 -0.0326117 -0.1068588 -0.0454782 0.0033418 -0.0342806 0.0783818 0.0062355 0.0273441 -0.062071 -0.0015258 0.0769713 -0.0283868 -0.0588344 0.0310295 -0.1174159 0.0755049 0.0064046 -0.04036 0.0030692 0.0311067 0.0052029 -0.0459445 -0.0024274 -0.0955859 0.1760306 0.0649454 -0.0386152 0.0084542 0.3272882 -0.1187172 -0.0519631 -0.0359133 0.067399 0.0224901 0.0567056 0.0886859 -0.0585376 0.3092865 0.1064664 0.0445511 0.0810379 0.1414147 -0.1036204 0.0977421 -0.0616465 0.1365509 0.0363952 0.0190978 0.0094381 -0.0152801 0.0788897 0.1073543 -0.015914 -0.0481059 -0.0531685 -0.1278457 -0.101727 -0.0123619 -0.0562248 0.0362864 0.0244412 -0.0650844 0.1032216 -0.046911 0.076996 0.0578215 0.1004098 0.0236781 -0.0264175 0.0881935 0.0529822 -0.1130338 0.0577316 0.1366801 -0.0039895 -0.0895619 -0.0236957 -0.0725332 -0.0246931 0.1464702 -0.0347649 0.1604251 0.075555 -0.014521 -0.0641762 0.0134493 0.0786985 0.3419904 -0.0793889 -0.0621634 -0.0665636 0.1389076 -0.0654738 -0.096251 -0.1146236 0.2759543 unknown
polarizability: 77.472191|-9.3122734|76.1985014|-0.1528793|5.0835545|78.0231957 unknown
InChI: InChI=1S/C6H11NO2/c1-4(2)3-5(7)6(8)9/h5,8H,1,3,7H2,2H3
charge 0 multiplicity 1
20 atoms
O  0.860298 1.594323 -1.096934
O  1.828566 1.097337 0.957329
N  1.836834 -1.712079 -0.05887
C  -0.486125 -1.054564 0.484049
C  0.784986 -0.730959 -0.364357
C  -1.68026 -0.143661 0.228935
C  1.220856 0.713905 -0.067075
C  -2.249441 -0.143864 -1.17913
C  -2.208923 0.617805 1.223722
H  -0.740127 -2.104229 0.238115
H  -0.202443 -1.019645 1.553393
H  0.536439 -0.801362 -1.436164
H  2.158255 -1.66021 0.915016
H  2.62387 -1.699299 -0.716022
H  -3.190963 0.428764 -1.233749
H  -2.449376 -1.175828 -1.527831
H  -1.536193 0.311537 -1.893142
H  -1.78443 0.618457 2.234669
H  -3.081536 1.259593 1.054632
H  1.114209 2.524576 -0.844886
