program: Gaussian 09
title: 000228812
version: EM64L-G09RevD.01
frameworkgroup: C1[X(C5H8INO2)]
method: RPBEPBE
basis: SDD
operation: Freq
keyword: #p
keyword: freq=noraman
keyword: PBEPBE/SDD
title: #p freq=noraman PBEPBE/SDD
converged: YES YES NO NO
title: Mulliken charges:
elementType: I O O N C C C C C H H H H H H H H
charge: 0.086310 -0.417415 -0.241093 -0.557641 -0.181996 -0.486057 0.176879 0.076050 -0.677645 0.274214 0.241278 0.222887 0.271424 0.278045 0.294443 0.263448 0.376869
chargesum: 0.00000
title: Mulliken charges with hydrogens summed into heavy atoms:
elementType: I O O N C C C C C
charge: 0.086310 -0.040546 -0.241093 0.014847 0.092218 -0.021892 0.176879 0.347474 -0.414196
polarizability: 1.30516308e+02 -1.39588560e+01 7.84269659e+01 -2.78118438e+00 -3.36808470e+00 5.88038505e+01
1716.lowfreq: -6.4608 -0.0004 0.0005 0.0008 1.6209 7.2871 30.9746 44.2326 66.6980
frequency: 30.8316 44.2038 66.6914 113.3092 186.2016 202.1875 244.9166 261.0578 280.8069 311.6257 451.2970 480.1183 574.1732 589.1627 623.0952 641.5069 706.2602 762.7653 787.8364 924.5155 969.0550 989.1756 1045.6776 1064.2823 1105.3875 1130.1124 1186.3265 1234.0760 1250.4422 1274.6142 1312.9951 1340.0213 1363.2529 1447.7843 1623.6021 1634.8959 1651.1124 2984.0309 3054.4302 3074.4880 3126.8799 3168.0900 3460.2682 3505.2404 3594.0099
redmass: 9.2963 7.9530 4.1552 2.4352 5.2919 5.2818 2.8059 3.0402 3.6643 1.2240 3.8087 3.4645 3.2123 1.2513 1.4234 3.2944 4.2468 1.9184 3.1733 1.6572 1.1710 2.9797 2.1230 3.1646 2.6662 1.2727 1.3485 1.3530 1.4692 1.1960 1.3900 1.6979 1.3337 1.0919 6.7971 1.1080 7.4182 1.0635 1.0861 1.0972 1.0925 1.0948 1.0446 1.0640 1.0989
irintensity: 1.7832 0.1708 0.1424 0.3229 1.1919 1.6965 3.8298 3.2363 4.6561 49.4664 23.3759 63.6808 1.3711 257.2191 125.3302 30.9365 22.1701 5.4526 11.1691 32.2831 75.4076 86.3512 204.5528 27.4132 17.3605 0.1321 2.7038 54.3276 21.0455 11.3690 5.3649 6.6992 8.1396 18.5791 32.5935 45.8550 197.8303 17.1065 8.2269 14.7310 4.1663 11.4492 4.8825 21.4172 5.9391
temp: 298.150 k
press: 1.00000 atm
elementType: 53 8 8 7 6 6 6 6 6 1 1 1 1 1 1 1 1
symmnumber: 1
zpe: 334193.6 jmol-1
zpe.correction: 0.127288 hartree
zpe.thermalcorrener: 0.138056 hartree
zpe.thermalcorrenthalpy: 0.139000 hartree
zpe.thermalcorrgfe: 0.087634 hartree
zpe.sumelectzpe: -411.306553 hartree
zpe.sumelectthermal: -411.295785 hartree
zpe.sumelectthermalent: -411.294840 hartree
zpe.sumelectthermalfe: -411.346206 hartree
dipole: -3.0866 0.3237 -0.9119
dipole: 3.2348
quadrupole: -56.4643 -64.7980 -72.9423
quadrupole: 1.1194 1.8448 2.6860
quadrupole: 8.2706 -0.0631 -8.2074 1.1194 1.8448 2.6860
hfenergy: -411.4338404 hartree
pointgroup: C01 [X(C5H8I1N1O2)]
dipole: 1.212221 0.1076879 0.372249 debye
dipolederiv: -0.5280566 -0.0673496 0.0443016 -0.2374118 -0.095101 0.0137056 0.0646932 -0.002714 -0.0081881 -0.5195239 0.1202711 -0.2742378 0.1811367 -0.4625635 0.4118159 -0.2971733 0.3815667 -0.9977901 -0.4119222 0.1317969 -0.0894001 -0.0117384 -0.74611 -0.2858734 -0.2904392 -0.1335748 -0.8188844 -0.6445381 -0.039322 -0.0041419 -0.1127642 -0.9105693 0.0150821 -0.1088657 -0.0016227 -0.1770009 0.5480149 -0.0276556 -0.026239 -0.0765963 0.2562677 -0.0052682 0.1338301 -0.0002285 0.1393803 -0.0768516 -0.025299 -0.0298519 0.1744739 0.059131 0.013567 -0.04018 0.0197856 0.1277703 0.3044856 -0.2140528 0.3922583 -0.2571465 1.0721472 -0.0243374 0.5612552 -0.1256707 1.3828624 -0.223589 -0.0534391 -0.0198034 -0.0414408 0.0135586 0.0598274 -0.0877885 0.0683859 -0.1659654 0.9112944 0.2731224 -0.1556675 0.3962445 0.1080724 0.0149768 -0.1808916 0.0145508 -0.3134042 0.0482187 -0.010383 0.0417067 0.0003514 0.0375169 -0.0197896 0.0585767 -0.0274331 -0.0733106 0.0641157 0.044311 -0.0075537 0.0115349 -0.103967 0.006405 -0.0165733 -0.0136987 0.0887961 -0.0836884 -0.0076263 0.0991242 -0.0427593 0.100022 -0.0611055 0.0722439 -0.0173846 -0.05857 0.108217 -0.0162749 0.0313978 -0.0576169 -0.0372132 -0.0231809 0.0411841 -0.0262753 0.1518013 0.177474 -0.0212015 0.0295689 0.0117333 0.2973305 -0.1365849 0.0548268 -0.0798433 0.0830574 0.0487599 0.0094297 -0.0519642 0.095507 0.3408544 0.1110648 -0.018823 0.0770042 0.1304233 -0.1013653 -0.1360707 0.0338356 -0.0860872 -0.0496687 -0.0258147 0.050156 -0.0155258 0.2102862 0.378955 0.0397433 -0.0133337 0.0525796 0.1202918 -0.06449 0.0039687 -0.1173215 0.2987362 unknown
polarizability: 132.8763628|7.8166014|76.8621633|-2.8952831|-1.2578739|58.0085982 unknown
InChI: InChI=1S/C5H8INO2/c6-3-1-2-4(7)5(8)9/h1,3-4,8H,2,7H2
charge 0 multiplicity 1
17 atoms
I  -4.384925 0.18051 0.004797
O  1.754146 -1.496267 1.53155
O  1.144021 -1.743691 -0.699363
N  2.35173 1.210612 0.162577
C  1.064567 0.516276 0.371409
C  0.036286 0.986118 -0.686243
C  1.276629 -1.007531 0.305006
C  -1.328636 0.34228 -0.525448
C  -2.436993 1.052505 -0.217528
H  0.70026 0.766477 1.382037
H  -0.026248 2.085631 -0.613179
H  0.4303 0.732378 -1.691512
H  -1.384135 -0.742361 -0.68446
H  2.7693 1.054014 -0.760694
H  3.022908 1.104418 0.928818
H  -2.451981 2.13493 -0.056937
H  1.956073 -2.468197 1.448871
