program: Gaussian 09
title: 000228810
version: EM64L-G09RevD.01
frameworkgroup: C1[X(C5H8ClNO2)]
method: RPBEPBE
basis: SDD
operation: Freq
keyword: #p
keyword: freq=noraman
keyword: PBEPBE/SDD
title: #p freq=noraman PBEPBE/SDD
converged: YES YES NO NO
title: Mulliken charges:
elementType: Cl O O N C C C C C H H H H H H H H
charge: -0.090034 -0.411565 -0.245514 -0.558628 -0.188905 -0.467212 0.189930 0.144004 -0.585829 0.278300 0.263600 0.233255 0.282209 0.292466 0.246999 0.241329 0.375596
chargesum: 0.00000
title: Mulliken charges with hydrogens summed into heavy atoms:
elementType: Cl O O N C C C C C
charge: -0.090034 -0.035969 -0.245514 0.016047 0.089395 0.029643 0.189930 0.144004 -0.097501
polarizability: 7.08368921e+01 3.02056506e+00 8.47843225e+01 4.94135770e+00 -7.49548437e+00 7.00929711e+01
1716.lowfreq: -9.4140 -6.6850 -2.3711 -0.0022 -0.0016 -0.0015 28.4573 40.0287 65.7246
frequency: 28.3041 39.9901 65.6624 120.6850 222.7744 247.8052 272.6248 320.1770 362.4388 376.0854 466.6370 526.7461 574.8778 595.6104 598.8262 633.2266 685.4642 711.0345 785.8507 911.0618 922.2214 976.3547 995.7123 1047.7305 1098.8183 1105.0442 1177.8720 1216.5062 1247.8842 1308.5157 1342.1410 1370.0045 1404.3687 1442.4125 1639.7592 1648.9811 1663.7082 3005.7404 3068.0787 3081.7205 3112.6013 3227.1292 3462.0050 3498.0020 3595.1296
redmass: 8.2264 7.0529 4.5319 5.4821 4.2654 3.7310 2.2573 1.4210 2.7274 3.2184 3.7557 4.5226 2.9695 2.5714 1.6236 1.4657 1.0574 3.9791 3.5416 1.7609 1.3310 2.0107 2.7441 2.1568 1.5913 3.1860 1.7382 1.4668 1.5179 1.3796 1.6330 1.3516 1.1412 1.1069 1.1867 5.1605 6.2458 1.0596 1.0920 1.0959 1.0631 1.1149 1.0448 1.0639 1.0987
irintensity: 2.4419 1.3772 0.8339 0.1985 2.6412 5.9759 11.3680 37.2846 3.7095 2.4954 36.4007 32.7858 56.5071 71.0128 181.4144 132.6747 2.5060 32.1147 4.3460 7.6408 81.9262 8.8922 53.8093 212.5071 54.6632 6.0667 32.4403 28.1044 11.3586 10.8681 9.6151 7.3384 5.7798 22.0098 63.5441 136.9728 73.8003 8.7416 1.1495 9.0341 0.5658 3.3525 4.5956 17.6845 6.6322
temp: 298.150 k
press: 1.00000 atm
elementType: 17 8 8 7 6 6 6 6 6 1 1 1 1 1 1 1 1
symmnumber: 1
zpe: 336176.5 jmol-1
zpe.correction: 0.128043 hartree
zpe.thermalcorrener: 0.138420 hartree
zpe.thermalcorrenthalpy: 0.139364 hartree
zpe.thermalcorrgfe: 0.090392 hartree
zpe.sumelectzpe: -859.863127 hartree
zpe.sumelectthermal: -859.852750 hartree
zpe.sumelectthermalent: -859.851806 hartree
zpe.sumelectthermalfe: -859.900778 hartree
dipole: -2.0949 0.2097 -0.0439
dipole: 2.1058
quadrupole: -57.6674 -60.2917 -58.9725
quadrupole: 5.3190 -4.0778 2.4163
quadrupole: 1.3098 -1.3145 0.0047 5.3190 -4.0778 2.4163
hfenergy: -859.9911703 hartree
pointgroup: C01 [X(C5H8Cl1N1O2)]
dipole: -0.7993741 0.1849214 -0.114965 debye
dipolederiv: -0.3285557 0.020628 -0.2566228 -0.0249545 -0.1579996 0.0994276 -0.2425798 0.138602 -0.5829401 -0.4323047 0.1043397 0.2252523 0.1096591 -0.5892804 -0.4970077 0.1741108 -0.452214 -0.8511145 -0.3896204 0.1850289 -0.1165851 0.1381812 -0.6170696 0.189414 0.0815893 0.0662233 -0.8929999 -0.5558731 0.0355044 0.0035316 -0.026817 -0.915811 0.0857216 0.0382263 0.0741848 -0.1873733 0.5111346 0.047099 0.0084958 0.0692138 0.2525776 -0.0225894 -0.0926845 -0.0481767 0.1169893 -0.1144453 -0.0698115 -0.0176166 -0.0488037 0.0056902 0.0240856 -0.0437621 0.0923959 -0.0571116 0.252066 -0.3629237 -0.0880238 -0.4340648 0.9929602 0.1805815 -0.153114 0.2591829 1.3694451 0.4494191 0.1355271 0.365508 0.2311723 0.1695708 -0.3106769 0.4757205 -0.3231055 0.8284755 -0.2512932 0.0657127 0.1210511 0.0243453 -0.3152731 0.0508571 0.088464 0.0517072 -0.3433727 0.0827673 -0.0052356 -0.0423655 -0.0111857 0.0440449 -0.0015051 -0.0384587 -0.0016775 -0.0474353 0.0469738 0.0145317 0.0157401 0.0316596 -0.0608061 0.0221857 -0.0036266 0.0197245 0.1094356 0.0175053 -0.0326859 -0.0832184 -0.0380161 0.1085254 0.0386908 -0.0337371 -0.0060424 -0.0693717 0.1728023 -0.0609207 -0.0439091 -0.0269748 0.3231512 0.1015036 -0.0617532 0.0411101 0.068439 0.0623539 -0.0506726 0.0813306 0.0271196 0.3184869 -0.1134395 0.0388496 -0.0901447 0.1495112 0.0293579 -0.0989676 -0.0491377 -0.1104131 0.1257408 0.0200506 -0.0595808 0.0116006 0.1224583 0.0968998 -0.0265314 -0.0891688 -0.0120941 0.1321948 0.0557033 -0.1113368 0.0373016 0.0139913 0.3508125 0.0993776 -0.0342619 0.101973 0.1832971 0.0769974 -0.056327 0.1293278 0.2529738 unknown
polarizability: 72.280248|6.1661306|73.056989|0.6522838|-9.9903052|80.3769488 unknown
InChI: InChI=1S/C5H8ClNO2/c1-3(6)2-4(7)5(8)9/h4,8H,1-2,7H2
charge 0 multiplicity 1
17 atoms
Cl 2.581439 -0.541252 1.203347
O  -1.492267 1.48379 1.155782
O  -1.385953 1.200595 -1.150279
N  -1.776312 -1.634889 0.216108
C  -0.677022 -0.659479 0.346214
C  0.488837 -1.052813 -0.597062
C  -1.181332 0.753091 0.002248
C  1.733976 -0.223775 -0.411495
C  2.266182 0.685901 -1.253902
H  -0.327388 -0.665675 1.391143
H  0.70173 -2.120496 -0.410247
H  0.152267 -0.941631 -1.645435
H  -2.209615 -1.658366 -0.712996
H  -2.462248 -1.610608 0.975677
H  3.180991 1.238078 -1.024653
H  1.761835 0.89368 -2.20401
H  -1.869722 2.36985 0.899559
