program: Gaussian 09
title: 000228792
version: EM64L-G09RevD.01
frameworkgroup: C1[X(C8H17N3O3)]
method: RPBEPBE
basis: SDD
operation: Freq
keyword: #p
keyword: freq=noraman
keyword: PBEPBE/SDD
title: #p freq=noraman PBEPBE/SDD
converged: YES YES NO NO
title: Mulliken charges:
elementType: O O O N N N C C C C C C C C H H H H H H H H H H H H H H H H H
charge: -0.414072 -0.235469 -0.275984 -0.352017 -0.594873 -0.520342 -0.365707 -0.406268 -0.354208 -0.156439 -0.404762 0.169023 0.196566 -0.515120 0.188487 0.214057 0.199949 0.220448 0.198206 0.228458 0.240275 0.258131 0.209834 0.300804 0.299880 0.268072 0.235365 0.229487 0.376973 0.281456 0.279789
chargesum: 0.00000
title: Mulliken charges with hydrogens summed into heavy atoms:
elementType: O O O N N N C C C C C C C C
charge: -0.037099 -0.235469 -0.275984 -0.051213 -0.026921 0.040902 0.036837 0.014129 0.072456 0.083836 0.063203 0.169023 0.196566 -0.050268
polarizability: 1.31880880e+02 5.65662070e+00 1.15528557e+02 -6.62132698e-01 7.99562144e-01 1.02203505e+02
1716.lowfreq: -40.2320 -9.4575 -5.5262 -0.0010 -0.0009 -0.0008 1.6207 13.2788 16.0142
frequency: -40.1870 12.4491 15.1532 30.4160 41.6885 73.6030 88.3678 112.8942 134.7796 185.6172 198.2783 209.8072 226.7541 245.6420 286.3752 320.9398 336.8140 363.3727 420.8460 464.4824 502.8256 548.0287 568.7350 584.5460 604.5204 617.2392 638.1840 713.4411 731.3011 749.9303 763.3946 819.7141 863.8949 894.1232 908.0921 946.9332 984.2165 1047.5705 1052.7873 1063.5942 1085.1074 1086.6324 1117.9263 1140.5256 1147.4419 1150.2248 1177.6969 1206.7640 1237.2844 1248.6570 1267.8253 1285.9079 1296.2683 1310.2981 1315.7605 1330.2492 1338.2811 1350.6972 1367.8203 1399.5406 1443.8689 1447.9306 1455.4589 1458.1079 1477.0326 1485.9302 1614.4040 1626.2481 1664.5952 1672.1533 2960.6892 2967.9055 2975.8756 2976.6290 2991.6562 3007.9018 3017.1531 3031.9325 3035.4055 3052.7723 3073.9339 3443.9949 3469.0213 3497.8277 3543.1388 3556.8507 3606.0657
redmass: 1.8876 5.3535 6.1185 6.2299 4.7875 4.0450 3.0986 2.2736 2.7438 2.0151 1.8138 2.6611 1.7140 1.8240 3.5589 3.0523 3.1894 3.6056 3.4954 2.6168 2.1956 1.7606 1.6477 1.6649 3.2050 1.2582 2.9563 2.5301 1.5575 1.7887 2.0226 2.2700 2.0496 1.5512 3.1383 2.0824 3.6262 3.3917 2.8259 2.2107 2.4064 2.2950 1.8660 1.2489 1.5972 3.0119 1.6499 1.8543 1.3834 1.4215 1.4698 1.2292 1.1083 1.3912 1.1785 1.3383 1.2131 1.4706 1.3279 1.8020 1.0899 1.1290 1.0894 1.0792 1.1207 1.6921 1.3309 6.5456 1.0847 3.5096 1.0613 1.0603 1.0621 1.0598 1.0652 1.0915 1.0895 1.1021 1.1000 1.1022 1.1003 1.0461 1.0448 1.0637 1.0772 1.0949 1.0987
irintensity: 7.8159 0.1900 2.4458 4.8099 3.9240 0.1546 0.1948 0.1645 2.6759 27.9867 33.6116 11.9433 62.6706 11.5388 3.5241 30.2285 18.0177 2.5825 4.0397 27.5432 11.9645 202.2726 76.6325 45.2121 15.8060 259.5358 30.7876 44.2938 7.9855 243.7458 33.5818 33.3269 2.9177 3.4083 1.5820 4.3341 18.4541 1.4750 237.4621 20.2587 2.3208 1.2106 3.8633 0.8454 11.7233 3.3202 9.6695 56.5241 25.0680 3.4541 5.8536 32.8303 6.6589 11.7977 10.1144 5.0375 0.2698 1.2768 6.6996 9.7563 11.1097 35.9664 2.2666 5.0357 22.5559 152.2345 153.4090 157.7366 41.7979 129.1023 7.7171 19.9154 47.0857 42.1774 37.4414 1.2205 24.4446 22.1952 1.9096 106.5108 10.2806 1.5771 7.5650 19.2650 10.7542 1.8926 8.6021
temp: 298.150 k
press: 1.00000 atm
elementType: 8 8 8 7 7 7 6 6 6 6 6 6 6 6 1 1 1 1 1 1 1 1 1 1 1 1 1 1 1 1 1
symmnumber: 1
zpe: 680595.9 jmol-1
zpe.correction: 0.259225 hartree
zpe.thermalcorrener: 0.275703 hartree
zpe.thermalcorrenthalpy: 0.276647 hartree
zpe.thermalcorrgfe: 0.211178 hartree
zpe.sumelectzpe: -703.848710 hartree
zpe.sumelectthermal: -703.832233 hartree
zpe.sumelectthermalent: -703.831289 hartree
zpe.sumelectthermalfe: -703.896757 hartree
dipole: -1.2253 -1.2825 2.5000
dipole: 3.0653
quadrupole: -108.8696 -84.3502 -83.2365
quadrupole: 7.3137 6.7379 2.9424
quadrupole: -16.7175 7.8019 8.9156 7.3137 6.7379 2.9424
hfenergy: -704.1079355 hartree
pointgroup: C01 [X(C8H17N3O3)]
dipole: 0.423866 -0.5829621 -0.9669043 debye
polarizability: 131.4534446|-6.2246582|115.706358|-1.5920725|-1.4041506|102.4531384 unknown
InChI: InChI=1S/C8H17N3O3/c9-5-7(12)11-4-2-1-3-6(10)8(13)14/h6,11,13H,1-5,9-10H2
charge 0 multiplicity 1
31 atoms
O  2.567269 1.453806 -1.55679
O  3.531847 1.892407 0.506461
O  -3.694246 -0.682734 1.061756
N  -2.217402 -0.486615 -0.729869
N  4.663668 -0.669547 0.432366
N  -4.743328 1.951197 0.66776
C  0.839736 -1.049822 -0.423211
C  2.147138 -1.105499 0.397884
C  -0.311633 -1.826152 0.253919
C  3.398713 -0.44463 -0.283345
C  -1.626448 -1.8273 -0.561578
C  3.201741 1.064963 -0.371911
C  -3.212767 -0.00443 0.104556
C  -3.707851 1.434314 -0.228395
H  1.025767 -1.469226 -1.434671
H  0.539435 0.005167 -0.573921
H  2.416529 -2.167058 0.575793
H  1.999621 -0.64337 1.394639
H  -0.005235 -2.881123 0.409461
H  -0.518884 -1.403373 1.255989
H  3.473813 -0.837296 -1.3144
H  -2.382759 -2.440683 -0.041577
H  -1.451627 -2.265124 -1.563751
H  -1.859554 0.116761 -1.472669
H  4.813918 -0.023045 1.213307
H  4.852868 -1.647917 0.661819
H  -4.091721 1.443419 -1.267654
H  -2.838594 2.12145 -0.211043
H  2.453654 2.444121 -1.553829
H  -5.596276 1.379894 0.643752
H  -4.415288 2.026444 1.637952
