program: Gaussian 09
title: 000228765
version: EM64L-G09RevD.01
frameworkgroup: C1[X(C7H13ClO2)]
method: RPBEPBE
basis: SDD
operation: Freq
keyword: #p
keyword: freq=noraman
keyword: PBEPBE/SDD
title: #p freq=noraman PBEPBE/SDD
converged: YES YES NO NO
title: Mulliken charges:
elementType: Cl O O C C C C C C C H H H H H H H H H H H H H
charge: -0.053463 -0.263360 -0.245033 -0.056140 -0.501329 -0.691231 -0.688628 0.271398 -0.213484 -0.567704 0.208142 0.236012 0.224644 0.245508 0.206540 0.207609 0.227640 0.218244 0.208846 0.225704 0.264416 0.257903 0.277766
chargesum: 0.00000
title: Mulliken charges with hydrogens summed into heavy atoms:
elementType: Cl O O C C C C C C C
charge: -0.053463 -0.263360 -0.245033 0.152002 -0.040672 -0.031574 -0.033898 0.271398 0.276636 -0.032035
polarizability: 1.02551260e+02 3.71084916e+00 9.12401897e+01 -3.00540212e+00 -7.62635722e-01 7.55076043e+01
1716.lowfreq: -33.7681 -21.5406 -8.8462 -0.0016 0.0004 0.0013 7.4054 20.4443 47.8142
frequency: -27.7745 17.1519 47.1500 70.0832 140.4137 174.2200 205.1294 214.6614 227.4950 276.1240 311.2853 355.5947 401.5643 438.1192 459.9691 577.0481 608.0688 727.3384 772.9893 786.4448 887.8566 896.5870 922.1419 937.7639 962.1285 966.2438 990.2157 1057.9320 1081.5462 1104.4413 1157.6392 1179.1713 1186.6766 1217.9325 1243.2370 1266.3155 1297.0882 1325.9812 1343.5691 1361.9305 1384.1904 1402.3322 1435.4195 1448.7298 1461.4971 1462.8454 1473.1674 1481.7385 1486.6486 1642.7567 2970.0741 2977.1054 2980.9613 2992.6888 3013.2372 3061.4076 3070.5591 3073.8639 3078.0787 3080.6717 3086.2882 3087.7587 3145.5426
redmass: 3.0130 8.2403 4.9248 3.2027 4.7051 2.5846 2.0151 1.7872 1.0600 2.5440 3.3820 2.1739 2.4149 2.4590 2.8007 4.6514 4.9242 4.4967 2.6821 3.6351 2.5922 1.6326 1.3213 1.9898 1.9896 1.6390 1.9184 2.1081 2.2970 1.5089 2.3399 1.2868 2.1662 1.1446 1.2518 1.4722 1.2115 1.5212 1.3354 1.4612 1.2085 1.2168 1.1046 1.1011 1.0782 1.0450 1.0559 1.0458 1.0537 9.6786 1.0807 1.0357 1.0381 1.0625 1.0610 1.0597 1.1000 1.0998 1.0997 1.0982 1.1009 1.1003 1.1098
irintensity: 0.3291 1.9127 1.8041 2.3443 0.8962 3.5621 3.0025 2.5317 0.1090 6.9327 3.9036 0.8118 6.4415 5.4921 3.2676 4.9997 23.0447 7.4991 4.0313 3.1100 22.3381 8.5478 3.4992 20.6580 12.4200 0.5036 24.3749 142.8670 32.2337 1.7293 162.1868 5.3341 29.8057 2.0886 21.9306 53.8156 21.5128 1.1913 5.7728 9.0514 22.3247 15.4475 10.6232 8.8575 15.4084 3.0650 7.0331 23.4238 16.6247 166.6409 26.7069 32.6948 21.4794 27.4327 20.2189 23.1616 22.7260 28.1065 43.7789 7.2082 30.9096 36.9561 9.0766
temp: 298.150 k
press: 1.00000 atm
elementType: 17 8 8 6 6 6 6 6 6 6 1 1 1 1 1 1 1 1 1 1 1 1 1
symmnumber: 1
zpe: 499409.9 jmol-1
zpe.correction: 0.190215 hartree
zpe.thermalcorrener: 0.201716 hartree
zpe.thermalcorrenthalpy: 0.202660 hartree
zpe.thermalcorrgfe: 0.150857 hartree
zpe.sumelectzpe: -884.239541 hartree
zpe.sumelectthermal: -884.228040 hartree
zpe.sumelectthermalent: -884.227096 hartree
zpe.sumelectthermalfe: -884.278899 hartree
dipole: -0.7628 -1.0921 1.9688
dipole: 2.3771
quadrupole: -60.3033 -69.9958 -70.1726
quadrupole: 9.3460 2.1444 -2.9220
quadrupole: 6.5206 -3.1719 -3.3487 9.3460 2.1444 -2.9220
hfenergy: -884.4297567 hartree
pointgroup: C01 [X(C7H13Cl1O2)]
dipole: -0.3513522 0.2972343 -0.8141626 debye
dipolederiv: -0.2308524 0.0300205 -0.0200981 -0.0534677 -0.4827368 0.1030128 0.0016158 0.1438281 -0.2164005 -1.5806598 -0.1467776 -0.1395273 -0.1502961 -0.3377835 -0.0983965 -0.0992036 -0.1175602 -0.4293262 -0.6746369 0.0364959 0.0470744 -0.1673309 -0.5473526 -0.2597769 -0.2619551 -0.3363125 -0.6595074 0.240666 -0.0731915 0.0047464 -0.1304796 0.2473016 0.0047366 0.1294621 -0.0706695 0.1434783 -0.2671174 0.1578681 0.0681215 0.1823653 -0.0960392 -0.0144075 -0.0235379 -0.0005829 0.0028743 0.0064036 -0.0109733 -0.0679193 0.0064199 0.0162926 -0.0330326 -0.0810793 -0.0226063 -0.0523921 0.0023034 -0.0587466 0.0007945 -0.0625589 -0.0354141 0.0269057 -0.0350621 0.0293789 0.0323071 1.7593843 0.0256384 0.077485 0.2916266 0.5271205 0.4107027 0.4230238 0.567628 0.743875 0.6970755 0.0082669 -0.080404 -0.1631183 0.1473456 -0.0158145 -0.2773515 -0.0491922 0.1879555 0.1193613 -0.0439478 0.0263965 -0.002086 0.6263108 -0.1886723 0.0192485 -0.2062326 0.2685776 -0.0965317 0.0523102 0.1119341 0.0799203 -0.0017705 -0.0525929 0.0881814 -0.0356534 -0.0902003 0.0320484 0.0097256 -0.0955559 -0.0003188 0.0735536 -0.0580761 -0.0534342 -0.0375058 -0.0737857 -0.0111375 -0.0914709 0.0546248 -0.0776535 -0.0565334 0.0349881 0.0443394 -0.0125834 0.0815915 0.0191994 0.037912 0.1174083 0.0040875 0.0796059 -0.0588102 0.0825969 -0.0506424 -0.0089385 -0.002003 0.0925379 -0.0719763 0.1413 -0.072662 0.0944495 -0.0735627 0.067461 0.03842 -0.0312801 -0.126122 0.0095306 -0.1635953 -0.0568719 0.0211171 0.0504467 0.0484867 0.0523459 0.0109381 0.0030465 0.0952832 0.0452877 0.0429051 -0.0668939 0.131597 -0.0487145 -0.0303906 0.0083823 -0.07411 -0.0992806 -0.0611833 0.064229 -0.0293363 -0.1150463 -0.0673744 -0.0793094 -0.0029297 0.1285908 -0.0404842 0.092158 -0.1021871 0.0721092 -0.04206 0.0957668 0.0684192 -0.0677991 -0.0158348 0.0160376 0.1023065 -0.1010293 0.0616881 0.0172311 0.0867913 0.0744908 0.0369987 -0.0131416 -0.0504448 0.0402856 0.1052776 -0.0047002 0.0617611 -0.016138 -0.0365689 -0.083594 0.0564619 0.0442984 0.0596246 -0.0216123 0.0226067 0.0698926 0.0195325 0.0663077 0.1157803 0.0154413 -0.0080448 -0.0132935 -0.0179495 0.0281932 -0.0571036 0.0128947 -0.0838233 unknown
polarizability: 103.1706405|-2.5346023|90.3451486|2.6652698|-2.5607056|75.7832646 unknown
InChI: InChI=1S/C7H13ClO2/c1-6(2)5-7(9)10-4-3-8/h6H,3-5H2,1-2H3
charge 0 multiplicity 1
23 atoms
Cl -2.810063 -1.626659 0.729009
O  -0.890678 0.612605 -0.654323
O  0.477928 1.659971 0.918699
C  2.24782 -0.757916 -0.312025
C  1.487267 0.435242 -0.985577
C  3.048166 -0.311275 0.933245
C  1.294936 -1.931609 0.014321
C  0.36404 0.982576 -0.128184
C  -2.084589 1.02679 0.120096
C  -3.183956 0.011253 -0.128274
H  2.971975 -1.10606 -1.077906
H  1.069351 0.107594 -1.952309
H  2.205935 1.25649 -1.165361
H  2.378785 0.082113 1.718219
H  3.610799 -1.165537 1.353159
H  3.772306 0.48588 0.681526
H  0.574236 -1.656413 0.806254
H  0.711762 -2.242583 -0.871527
H  1.871034 -2.804549 0.372302
H  -2.406755 2.018804 -0.255145
H  -1.823501 1.122678 1.188015
H  -4.140349 0.356207 0.293852
H  -3.291153 -0.228401 -1.195968
