program: Gaussian 09
title: 000228763
version: EM64L-G09RevD.01
frameworkgroup: C1[X(C10H18O2)]
method: RPBEPBE
basis: SDD
operation: Freq
keyword: #pfreq=noraman
keyword: PBEPBE/SDD
title: #p freq=noraman PBEPBE/SDD
converged: NO YES NO NO
title: Mulliken charges:
elementType: O O C C C C C C C C C C H H H H H H H H H H H H H H H H H H
charge: -0.282700 -0.247267 -0.007756 -0.459144 -0.444535 -0.430178 -0.431635 0.244215 -0.511912 -0.347962 -0.342632 -0.691878 0.257242 0.200444 0.241234 0.233337 0.229811 0.225955 0.216913 0.216967 0.210713 0.232046 0.239865 0.199043 0.223531 0.193721 0.192432 0.210595 0.213636 0.215898
chargesum: 0.00000
title: Mulliken charges with hydrogens summed into heavy atoms:
elementType: O O C C C C C C C C C C
charge: -0.282700 -0.247267 0.249486 -0.017467 0.018613 0.012690 -0.003955 0.244215 -0.040000 0.074612 0.043522 -0.051749
polarizability: 1.42342756e+02 -2.27408124e+00 1.01915184e+02 1.18659101e+00 -1.93841370e-02 9.32988990e+01
1716.lowfreq: -20.7939 -13.5776 -8.4600 0.0002 0.0006 0.0006 7.9182 28.2088 44.9119
frequency: -7.9326 24.5156 44.7150 63.5790 69.7211 107.0530 133.4688 173.4099 223.1247 228.7308 252.3708 297.5915 368.0222 410.7230 459.6978 553.9223 578.2836 641.2897 698.3861 728.8493 771.5353 791.9836 801.1650 855.3037 875.6775 898.5700 904.3763 906.9107 921.1657 935.6062 948.7306 1015.3723 1032.1371 1055.3703 1078.6587 1089.0454 1094.5340 1107.6644 1140.9498 1160.0988 1162.6102 1198.0858 1207.2543 1218.9617 1258.0744 1262.0357 1276.2226 1285.0705 1290.3386 1305.6491 1311.8646 1317.7957 1327.7317 1341.6196 1360.1710 1389.1137 1441.9508 1450.4686 1459.9638 1469.2707 1469.5332 1476.5799 1477.0297 1481.6668 1488.6776 1630.8985 2964.1151 2974.0416 2974.9674 2989.7353 2993.2361 2996.7588 3003.2567 3008.3515 3021.5209 3042.0376 3054.3176 3063.8867 3064.3736 3070.5946 3073.2250 3074.0142 3081.8205 3090.1354
redmass: 2.8160 2.2038 5.4626 2.7158 2.3210 2.1477 3.1563 2.4572 1.8999 1.4625 2.8632 4.1195 2.5822 3.4816 2.5607 1.9330 3.2229 3.0904 3.3845 1.1223 2.8756 1.3848 1.7768 2.0056 4.2464 2.1809 2.1429 2.1841 1.2873 1.4754 3.3804 1.4657 3.5951 1.7753 2.0385 2.1113 1.7634 2.0647 2.1844 1.6123 1.6311 1.5379 1.4500 1.3516 1.3486 1.2710 1.2121 1.3243 1.0742 1.2498 1.3736 1.4460 1.4624 1.4722 1.6859 1.2171 1.0854 1.0883 1.0802 1.0660 1.0842 1.0429 1.0660 1.0997 1.0841 9.9757 1.0590 1.0457 1.0554 1.0622 1.0626 1.0657 1.0620 1.0983 1.0629 1.0971 1.0935 1.0957 1.0977 1.1017 1.1004 1.0997 1.1008 1.1035
irintensity: 0.0882 0.3508 1.4437 0.2334 0.4273 0.1224 2.9379 3.6772 2.3080 2.3283 0.5914 6.6980 2.1641 6.4080 0.4000 2.6083 3.5983 2.0060 0.6238 12.5338 9.3646 0.4450 3.3634 5.4979 12.7634 12.9956 4.9436 4.5719 4.1840 23.0840 46.7833 1.6007 19.2439 11.6786 15.9778 89.1966 7.9919 2.8199 248.0540 29.5420 0.9931 3.4136 10.3348 1.0249 45.6399 5.1337 14.0432 0.1434 2.3413 0.2140 0.9367 1.2289 38.1561 10.2562 5.2149 14.3716 18.1780 14.0649 8.6719 0.7592 10.5726 12.5049 3.1928 6.8766 20.3252 163.5347 30.7232 30.6001 5.1097 44.1568 40.4328 25.4154 33.8655 11.7756 21.8027 3.1701 33.8003 5.1531 1.9580 29.9342 90.7593 67.6061 11.4852 81.9154
temp: 298.150 k
press: 1.00000 atm
elementType: 8 8 6 6 6 6 6 6 6 6 6 6 1 1 1 1 1 1 1 1 1 1 1 1 1 1 1 1 1 1
symmnumber: 1
zpe: 689894.4 jmol-1
zpe.correction: 0.262767 hartree
zpe.thermalcorrener: 0.275655 hartree
zpe.thermalcorrenthalpy: 0.276599 hartree
zpe.thermalcorrgfe: 0.221497 hartree
zpe.sumelectzpe: -541.348797 hartree
zpe.sumelectthermal: -541.335909 hartree
zpe.sumelectthermalent: -541.334965 hartree
zpe.sumelectthermalfe: -541.390067 hartree
dipole: 0.8591 -1.5440 0.5850
dipole: 1.8613
quadrupole: -65.9999 -78.6837 -73.2926
quadrupole: 3.3719 -1.1728 2.3607
quadrupole: 6.6588 -6.0250 -0.6338 3.3719 -1.1728 2.3607
hfenergy: -541.6115635 hartree
pointgroup: C01 [X(C10H18O2)]
dipole: 0.3574969 -0.4402464 0.4632574 debye
polarizability: 142.4597755|-0.8861708|100.2192575|0.9154328|-3.337451|94.8778056 unknown
InChI: InChI=1S/C10H18O2/c1-2-3-8-10(11)12-9-6-4-5-7-9/h9H,2-8H2,1H3
charge 0 multiplicity 1
30 atoms
O  0.697694 -0.564849 -0.219652
O  -0.559805 0.896606 -1.533259
C  1.964727 -0.004605 -0.822388
C  3.068381 -1.041823 -0.539116
C  2.387266 1.295261 -0.073662
C  3.64868 -0.61448 0.831513
C  3.681085 0.93272 0.720078
C  -0.503741 -0.025404 -0.684611
C  -1.693617 -0.726969 -0.047427
C  -2.950128 0.167373 0.024761
C  -4.194504 -0.604825 0.516013
C  -5.449448 0.290327 0.601535
H  1.759324 0.165989 -1.892508
H  3.848511 -0.952475 -1.320576
H  2.67515 -2.071851 -0.565466
H  1.573645 1.59517 0.609573
H  2.542381 2.1313 -0.776846
H  4.640378 -1.053838 1.03787
H  2.961384 -0.926322 1.640546
H  3.723827 1.433248 1.703312
H  4.57815 1.244062 0.15083
H  -1.914569 -1.623677 -0.663582
H  -1.398732 -1.102072 0.948797
H  -2.756015 1.024331 0.700146
H  -3.141831 0.599028 -0.975668
H  -3.987606 -1.049065 1.511239
H  -4.391447 -1.454446 -0.169823
H  -5.288015 1.132784 1.300282
H  -5.697367 0.719291 -0.387483
H  -6.329259 -0.278189 0.954671
