program: Gaussian 09
title: 000228762
version: EM64L-G09RevD.01
frameworkgroup: C1[X(C10H19ClO2)]
method: RPBEPBE
basis: SDD
operation: Freq
keyword: #p
keyword: freq=noraman
keyword: PBEPBE/SDD
title: #p freq=noraman PBEPBE/SDD
converged: NO YES NO NO
title: Mulliken charges:
elementType: Cl O O C C C C C C C C C C H H H H H H H H H H H H H H H H H H H
charge: -0.015301 -0.266442 -0.209537 -0.377121 -0.371128 -0.379139 -0.352818 -0.392850 -0.356360 -0.283206 -0.695251 0.348700 -0.693385 0.195028 0.195149 0.190989 0.190919 0.196601 0.196717 0.188628 0.188589 0.214513 0.214379 0.195503 0.195509 0.232554 0.232695 0.209893 0.209891 0.216456 0.289906 0.289918
chargesum: 0.00000
title: Mulliken charges with hydrogens summed into heavy atoms:
elementType: Cl O O C C C C C C C C C C
charge: -0.015301 -0.266442 -0.209537 0.013057 0.010780 0.014179 0.024399 0.036043 0.034653 0.182042 -0.059011 0.348700 -0.113562
polarizability: 1.78764043e+02 4.58069097e+00 1.07620310e+02 -5.08319012e-02 -4.15643212e-02 9.05109324e+01
1716.lowfreq: -13.8453 -3.4535 0.0005 0.0006 0.0016 5.1053 21.9101 22.5593 31.1151
frequency: -13.1913 22.0859 31.1141 49.4503 55.1478 87.2058 90.3829 104.4489 135.0735 149.7577 161.5041 166.0177 174.4283 224.9829 231.3674 294.3397 335.1281 402.8364 461.1680 488.0725 539.4596 651.2536 724.4495 731.5786 737.0211 753.7643 794.9053 859.6310 860.9002 888.6531 915.4454 936.3644 939.9550 995.1292 1012.7065 1021.8807 1047.6177 1077.4514 1080.1727 1086.9745 1117.8798 1125.7879 1148.6637 1150.6390 1188.7857 1222.1318 1224.0588 1259.7996 1264.5179 1278.9518 1280.6787 1285.4751 1297.4702 1299.5435 1303.6666 1337.4699 1354.9101 1358.0228 1372.8429 1389.3773 1422.7884 1463.3245 1464.2142 1468.4724 1470.1137 1475.4767 1476.4389 1481.6057 1487.9533 1491.4676 1669.8972 2953.0310 2955.1152 2958.8712 2965.7692 2970.8578 2973.2162 2987.8622 2992.6509 2996.4307 3004.8584 3008.6476 3024.8814 3039.3283 3050.3098 3059.6440 3069.6992 3072.5971 3079.9770 3135.1928
redmass: 4.2839 4.8981 5.2237 2.4206 2.8514 4.8536 1.6898 2.5338 1.8256 2.1675 6.1667 4.4768 2.6660 1.1363 6.6997 4.1256 4.5896 3.6095 3.7108 3.3491 2.9124 7.0157 1.0615 1.0795 6.7292 1.1064 1.1620 8.6852 1.2074 1.9335 1.8011 6.7217 1.1992 4.5994 1.1158 3.6496 3.2465 2.4746 2.3080 2.4207 3.4734 2.9585 1.1881 1.3233 1.6618 1.2818 1.3844 1.2473 1.2916 1.1091 1.4278 1.0566 1.1213 1.0919 1.3313 1.4068 1.5955 1.6153 1.5347 1.2169 1.0866 1.0714 1.0737 1.0692 1.0804 1.0756 1.0423 1.0806 1.0898 1.0979 10.6666 1.0588 1.0588 1.0591 1.0592 1.0588 1.0365 1.0968 1.0598 1.0992 1.0566 1.1021 1.1041 1.1044 1.1045 1.0570 1.1007 1.0993 1.1083 1.1074
irintensity: 3.9893 0.1295 0.5244 1.1005 0.6152 0.8337 0.8363 0.4244 1.7272 0.1508 1.2833 0.1120 6.4033 0.0004 2.0359 2.0515 10.1535 1.2060 3.1172 1.2291 2.5138 7.1662 14.5773 0.2826 30.7321 4.3117 0.1460 6.2778 0.6126 4.1398 7.6222 91.9446 0.9503 4.3633 0.0458 7.6716 1.3142 1.7996 17.6033 78.0780 377.9446 17.5288 0.9241 0.9397 0.0002 10.9161 0.1387 0.0064 0.6242 0.3073 30.1611 0.5809 0.0542 0.0998 1.5607 0.3786 1.6571 0.1756 4.4222 11.5420 29.1339 0.0359 0.0475 0.7416 0.0287 3.3500 12.5649 0.9679 2.5745 33.6203 165.2087 0.1675 1.3136 0.8504 15.3298 153.1009 36.3174 0.0296 20.6404 0.3289 36.3609 1.0552 0.0006 76.9345 48.5136 8.5778 93.5595 53.6430 75.1996 1.8740
temp: 298.150 k
press: 1.00000 atm
elementType: 17 8 8 6 6 6 6 6 6 6 6 6 6 1 1 1 1 1 1 1 1 1 1 1 1 1 1 1 1 1 1 1
symmnumber: 1
zpe: 719261.8 jmol-1
zpe.correction: 0.273952 hartree
zpe.thermalcorrener: 0.289925 hartree
zpe.thermalcorrenthalpy: 0.290870 hartree
zpe.thermalcorrgfe: 0.227461 hartree
zpe.sumelectzpe: -1001.900806 hartree
zpe.sumelectthermal: -1001.884833 hartree
zpe.sumelectthermalent: -1001.883889 hartree
zpe.sumelectthermalfe: -1001.947297 hartree
dipole: -3.8848 -2.0254 0.0173
dipole: 4.3811
quadrupole: -110.5744 -90.9840 -85.1582
quadrupole: -11.6023 0.0920 -0.0340
quadrupole: -15.0022 4.5882 10.4140 -11.6023 0.0920 -0.0340
hfenergy: -1002.1747581 hartree
pointgroup: C01 [X(C10H19Cl1O2)]
dipole: 1.5366305 0.7808621 0.0051163 debye
polarizability: 178.8507352|3.8393815|107.5315031|-0.3002774|0.1299446|90.5130473 unknown
InChI: InChI=1S/C10H19ClO2/c1-2-3-4-5-6-7-8-13-10(12)9-11/h2-9H2,1H3
charge 0 multiplicity 1
32 atoms
Cl -6.849871 0.315985 0.033447
O  -2.815534 0.470125 0.020679
O  -4.256386 -1.370574 0.019227
C  2.195463 0.39951 -0.004697
C  3.483834 -0.453688 -0.01093
C  0.904806 -0.45057 -0.002432
C  4.776391 0.393366 -0.013104
C  -0.378828 0.413734 0.006222
C  6.065742 -0.459658 -0.01861
C  -1.635358 -0.454569 0.008328
C  7.352234 0.394314 -0.02061
C  -4.07116 -0.139818 0.026067
C  -5.114072 0.974865 0.044078
H  2.199214 1.063018 0.885002
H  2.193394 1.067332 -0.891156
H  3.480095 -1.117918 -0.900467
H  3.485801 -1.12201 0.875544
H  0.909946 -1.118879 0.883549
H  0.902597 -1.112603 -0.893116
H  4.7771 1.061512 -0.89978
H  4.78232 1.058004 0.876189
H  -0.392316 1.075511 -0.880913
H  -0.384764 1.06846 0.898672
H  6.064253 -1.127058 0.867355
H  6.059096 -1.123424 -0.90728
H  -1.697227 -1.104244 0.90086
H  -1.707724 -1.093744 -0.890942
H  7.39726 1.044301 0.873641
H  7.391607 1.048591 -0.911997
H  8.259075 -0.237909 -0.025001
H  -4.996703 1.614577 -0.843169
H  -4.996987 1.584462 0.952443
