program: Gaussian 09
title: 000228754
version: EM64L-G09RevD.01
frameworkgroup: C1[X(C10H20O3)]
method: RPBEPBE
basis: SDD
operation: Freq
keyword: #pfreq=noraman
keyword: PBEPBE/SDD
title: #p freq=noraman PBEPBE/SDD
converged: YES YES NO NO
title: Mulliken charges:
elementType: O O O C C C C C C C C C C H H H H H H H H H H H H H H H H H H H H
charge: -0.259836 -0.296038 -0.248111 -0.402243 0.053849 -0.310296 -0.347546 -0.510295 -0.341779 -0.715979 0.246829 -0.692266 -0.506378 0.220598 0.229644 0.178605 0.261041 0.214513 0.198939 0.222180 0.232864 0.242950 0.194548 0.192499 0.219511 0.227699 0.217558 0.210677 0.213217 0.216124 0.233312 0.197210 0.206401
chargesum: 0.00000
title: Mulliken charges with hydrogens summed into heavy atoms:
elementType: O O O C C C C C C C C C C
charge: -0.259836 -0.296038 -0.248111 0.047999 0.232454 0.165257 0.073573 -0.034481 0.045269 -0.051211 0.246829 -0.052248 0.130546
polarizability: 1.56572419e+02 4.58943168e+00 1.06136811e+02 -3.94070279e-02 3.56845333e+00 9.84210265e+01
1716.lowfreq: -21.7972 -3.2504 -0.0008 -0.0004 0.0003 5.3980 12.5506 22.2076 28.8639
frequency: 11.6976 21.5354 28.2686 51.3202 65.6847 83.9575 98.8664 114.2747 120.0872 166.1734 183.9732 224.7840 231.8066 249.8931 262.7600 281.5320 307.7489 367.8755 387.3983 444.1302 472.5101 516.1012 594.8668 664.4330 727.8425 743.9176 790.0513 804.8744 833.6365 903.4552 910.0373 921.2229 933.6146 963.9929 1019.2964 1034.0914 1053.7634 1079.7712 1090.2583 1097.4973 1107.7867 1109.7727 1115.0567 1137.4778 1147.4226 1167.7370 1208.1913 1228.1954 1258.6981 1275.8789 1279.2041 1288.5857 1290.2399 1327.8128 1334.1307 1345.2383 1357.7682 1373.6467 1383.1960 1390.5041 1434.5910 1442.7757 1449.7433 1455.8715 1462.1245 1466.1364 1467.6539 1476.4399 1477.4776 1478.8649 1481.7523 1487.5937 1636.5139 2909.0952 2929.8109 2963.3883 2973.9840 2977.0098 2984.1133 2988.9827 3006.8030 3007.8683 3008.8874 3022.8711 3042.8349 3065.4067 3069.5464 3073.0134 3073.8582 3079.7653 3088.3630 3097.1783 3131.0135
redmass: 3.1624 3.5336 1.9296 5.2686 2.3517 2.9538 3.2244 1.9988 3.3507 2.1431 1.0500 1.6601 1.1263 3.4298 2.3119 3.0644 4.2125 2.9643 3.8567 2.9522 2.8577 2.7729 3.5204 4.1979 1.1049 2.2274 1.2849 1.7609 3.1217 1.7883 1.7365 1.3166 5.5846 1.5874 3.5122 3.7093 4.8272 2.0811 2.1688 2.0059 2.0638 1.5904 1.5989 1.9355 2.5107 1.6456 1.4425 1.3406 1.3551 1.2103 1.2611 1.0724 1.1169 1.2200 1.4782 1.4314 1.6601 1.4789 1.2289 1.2184 1.1314 1.0871 1.0854 1.0558 1.0814 1.0667 1.0665 1.0696 1.0420 1.0552 1.0515 1.0797 9.0459 1.0833 1.0357 1.0590 1.0369 1.0646 1.0362 1.0618 1.0609 1.0985 1.0987 1.0631 1.0978 1.0989 1.1016 1.1000 1.0999 1.0987 1.1003 1.0975 1.1030
irintensity: 0.0454 1.5028 1.0302 0.4507 7.0844 0.3016 0.5934 0.0606 1.3107 1.9787 1.0927 3.0887 0.0715 2.2248 6.2624 3.2449 14.4448 4.8909 7.4597 5.6690 1.0646 0.4366 7.1510 6.2382 13.2999 2.7357 0.7378 12.3251 2.6958 19.1605 8.2918 5.8966 44.3512 2.0354 24.6370 4.7725 73.6531 16.1590 137.5969 9.3568 3.6433 3.0578 9.9615 139.6494 129.8610 17.0897 8.0143 12.9748 43.2793 2.2883 12.6697 1.1253 4.8349 24.6933 22.7105 26.8069 10.2058 6.8412 19.9619 14.5138 2.6097 19.6825 1.4764 7.8831 13.6692 11.7401 1.2163 4.0919 12.7193 13.3699 9.4871 19.7789 145.5226 50.1053 87.7214 31.0536 33.2906 0.4984 15.0290 46.3563 3.7572 9.7772 80.2858 37.5929 4.6800 0.8220 4.6866 76.8455 83.5666 43.7013 33.4415 31.3739 11.7718
temp: 298.150 k
press: 1.00000 atm
elementType: 8 8 8 6 6 6 6 6 6 6 6 6 6 1 1 1 1 1 1 1 1 1 1 1 1 1 1 1 1 1 1 1 1
symmnumber: 1
zpe: 751834.3 jmol-1
zpe.correction: 0.286359 hartree
zpe.thermalcorrener: 0.303359 hartree
zpe.thermalcorrenthalpy: 0.304304 hartree
zpe.thermalcorrgfe: 0.237886 hartree
zpe.sumelectzpe: -617.644685 hartree
zpe.sumelectthermal: -617.627684 hartree
zpe.sumelectthermalent: -617.626740 hartree
zpe.sumelectthermalfe: -617.693157 hartree
dipole: -1.2668 0.2738 -0.2322
dipole: 1.3167
quadrupole: -64.3679 -80.0492 -85.3616
quadrupole: -3.3946 -6.8911 -3.1328
quadrupole: 12.2250 -3.4563 -8.7687 -3.3946 -6.8911 -3.1328
hfenergy: -617.9310431 hartree
pointgroup: C01 [X(C10H20O3)]
dipole: -0.5011495 0.1302277 0.0158407 debye
polarizability: 156.3721821|4.1550063|98.4052547|3.7762261|3.494022|106.3528196 unknown
InChI: InChI=1S/C10H20O3/c1-4-5-6-10(11)13-8-7-9(2)12-3/h9H,4-8H2,1-3H3
charge 0 multiplicity 1
33 atoms
O  0.128682 -0.466168 -1.156014
O  -4.063334 -0.089306 -0.807929
O  0.941742 -0.985857 0.969401
C  -1.871494 0.461927 0.005935
C  -3.324888 0.203632 0.441483
C  -1.261335 -0.761752 -0.691242
C  3.550982 0.15285 0.181764
C  2.504953 -0.34073 -0.840958
C  4.954957 0.304827 -0.444369
C  -3.923109 1.403355 1.200235
C  1.150305 -0.628014 -0.214373
C  6.002942 0.816306 0.567331
C  -5.397648 -0.645917 -0.597311
H  -1.855779 1.325685 -0.684611
H  -1.270273 0.718465 0.897139
H  -3.362756 -0.702328 1.092855
H  -1.812399 -1.009845 -1.609333
H  -1.228152 -1.630665 -0.00821
H  3.226238 1.125333 0.602448
H  3.5888 -0.555336 1.030926
H  2.859344 -1.284702 -1.305285
H  2.369874 0.378285 -1.668404
H  4.902758 0.999895 -1.30731
H  5.281192 -0.674086 -0.852122
H  -3.333577 1.612654 2.111772
H  -3.910225 2.304542 0.561301
H  -4.965212 1.213361 1.5134
H  5.717967 1.808135 0.966075
H  6.094674 0.124506 1.425652
H  7.000967 0.912931 0.10194
H  -5.763289 -0.942532 -1.593522
H  -5.366142 -1.539891 0.062832
H  -6.099766 0.094641 -0.162694
