program: Gaussian 09
title: 000228747
version: EM64L-G09RevD.01
frameworkgroup: C1[X(C7H13ClO2)]
method: RPBEPBE
basis: SDD
operation: Freq
keyword: #p
keyword: freq=noraman
keyword: PBEPBE/SDD
title: #p freq=noraman PBEPBE/SDD
converged: YES YES NO NO
title: Mulliken charges:
elementType: Cl O O C C C C C C C H H H H H H H H H H H H H
charge: -0.055186 -0.266970 -0.238611 -0.347110 -0.341437 -0.501572 -0.691236 0.260848 -0.234524 -0.553321 0.201559 0.222642 0.193305 0.194164 0.244192 0.242640 0.210847 0.213881 0.216830 0.226080 0.267844 0.258119 0.277015
chargesum: 0.00000
title: Mulliken charges with hydrogens summed into heavy atoms:
elementType: Cl O O C C C C C C C
charge: -0.055186 -0.266970 -0.238611 0.077092 0.046031 -0.014740 -0.049678 0.260848 0.259400 -0.018187
polarizability: 1.10667293e+02 -4.86843868e+00 8.31573875e+01 -4.19075017e+00 2.53828382e+00 7.78421415e+01
1716.lowfreq: -9.4203 0.0023 0.0028 0.0033 4.2817 11.5795 19.9445 26.9130 35.6425
frequency: 15.2820 26.7418 35.2502 68.8707 95.3998 116.0192 167.1078 209.9610 226.8594 277.2648 295.8797 326.8858 415.6844 477.5261 553.9728 609.8625 674.4391 725.7440 785.2895 795.0690 880.4147 904.5012 919.9312 943.8517 991.3783 1033.1967 1076.2041 1080.0329 1089.9533 1108.8292 1131.5276 1182.9486 1206.1798 1221.6713 1258.6962 1277.0927 1288.9082 1298.7963 1331.0383 1353.4649 1365.1649 1391.6852 1433.9327 1440.6608 1462.0645 1468.0565 1475.9408 1476.9666 1487.9212 1657.1446 2964.0331 2974.7731 2979.1289 2991.5066 2999.8392 3008.1087 3041.3351 3058.2393 3063.5023 3073.1137 3074.5683 3081.8205 3143.1614
redmass: 3.2830 4.9903 3.0869 3.2814 3.4016 2.0418 3.4973 3.2601 1.2314 2.8001 3.6428 3.9377 3.0731 2.8826 2.9658 4.8498 5.2299 1.1116 1.8484 1.7959 2.7475 1.8284 1.2892 2.5500 1.8790 3.4118 2.2092 1.9186 3.1388 1.8279 2.4385 1.2989 1.4368 1.1393 1.3379 1.2007 1.0676 1.2026 1.4499 1.4508 1.6655 1.2197 1.1021 1.0836 1.0804 1.0678 1.0557 1.0530 1.0815 9.7632 1.0591 1.0366 1.0648 1.0618 1.0606 1.0985 1.0970 1.0592 1.0997 1.1006 1.0997 1.1011 1.1097
irintensity: 0.4580 0.3649 1.6650 1.2211 3.1804 0.2825 2.4918 5.5996 0.7770 0.9599 2.4748 15.1834 8.5946 6.4034 3.3289 23.2007 4.4752 13.1972 1.7339 3.1198 24.5311 7.8041 4.4506 34.2690 16.3764 30.7370 3.8435 58.2001 154.3783 0.8260 164.2232 0.7076 2.6115 1.2238 40.5326 6.1146 0.8098 20.4355 26.1649 4.4405 14.8834 15.5770 10.1864 21.1045 18.1411 1.0156 7.1644 9.1598 20.3618 165.4514 31.5441 33.3291 1.2416 41.9611 31.1374 11.3452 3.0748 25.3907 3.4254 90.0713 62.0713 6.5199 10.0941
temp: 298.150 k
press: 1.00000 atm
elementType: 17 8 8 6 6 6 6 6 6 6 1 1 1 1 1 1 1 1 1 1 1 1 1
symmnumber: 1
zpe: 499981.6 jmol-1
zpe.correction: 0.190433 hartree
zpe.thermalcorrener: 0.202957 hartree
zpe.thermalcorrenthalpy: 0.203902 hartree
zpe.thermalcorrgfe: 0.147869 hartree
zpe.sumelectzpe: -884.239260 hartree
zpe.sumelectthermal: -884.226735 hartree
zpe.sumelectthermalent: -884.225791 hartree
zpe.sumelectthermalfe: -884.281824 hartree
dipole: 0.2711 -1.2677 -2.4527
dipole: 2.7742
quadrupole: -60.1253 -68.0228 -71.6728
quadrupole: -9.3361 -2.0646 2.5657
quadrupole: 6.4817 -1.4159 -5.0658 -9.3361 -2.0646 2.5657
hfenergy: -884.4296926 hartree
pointgroup: C01 [X(C7H13Cl1O2)]
dipole: 0.1570775 -0.097999 -1.0756206 debye
dipolederiv: -0.2096952 -0.0119627 0.0097689 -0.0872618 -0.3582266 -0.1556134 -0.0575275 -0.1992617 -0.3448434 -1.6384804 -0.0651349 0.2977616 0.0561647 -0.3772496 0.0827978 0.4097011 0.118526 -0.5031472 -0.7023028 0.0925548 -0.0155908 -0.1106037 -0.6017366 0.3286022 0.2788141 0.2849396 -0.6266696 0.0553631 0.0151791 0.0136916 0.0678213 0.0720449 0.0561257 -0.0369884 0.0706563 0.1129322 0.0320742 0.002794 0.0143378 -0.0428506 0.1212106 0.0248174 0.0442141 0.020082 0.1756299 -0.2437601 0.111276 -0.0074347 0.2704666 -0.087141 0.0960056 -0.0108108 0.0958724 0.0866871 -0.0727465 -0.0155249 0.0270553 0.0196782 0.0628852 0.0145795 0.0150948 0.0167797 0.0800518 1.6994839 -0.1292517 -0.2855617 0.0052982 0.6936559 -0.4746077 -0.7516767 -0.4612477 0.8072574 0.7263894 -0.0152352 0.0032383 -0.2771538 0.1447505 0.0460011 0.1554855 0.0089656 0.1290963 0.1055393 0.0041711 0.0091748 0.0717433 0.4193954 0.248477 0.0477334 0.2724025 0.4732887 0.0242804 -0.0359856 -0.0153946 -0.0440036 -0.117723 -0.0847424 -0.0100319 -0.1028315 0.0254335 0.067541 0.0036838 -0.0007304 -0.0130248 0.0647259 0.0370813 0.0072179 0.0476354 -0.1205976 0.0279885 -0.003076 0.0327195 0.0104218 0.0507153 0.0513838 0.0046806 0.0850033 -0.1906428 0.0114962 -0.0698712 -0.0282641 -0.0391806 -0.1452283 -0.0864275 -0.025933 -0.1125945 0.0241817 0.0461037 -0.0092762 -0.0226027 -0.0541307 -0.0444353 -0.0545673 -0.0273738 -0.0776846 0.0663888 0.0474217 0.0147995 0.0090877 -0.0324676 0.1050143 0.016548 0.0305043 0.0413496 -0.0930192 0.0652685 -0.0311814 0.0000067 -0.0939149 -0.1104066 -0.1018488 -0.0254377 -0.1174071 0.0231208 0.0748662 -0.0065518 -0.0254769 -0.0309643 0.0781423 0.0535656 0.0378953 0.0575585 -0.1690931 -0.1369211 0.1162144 -0.0222713 0.1509596 -0.0205328 0.0338904 -0.035213 0.0383734 0.089118 -0.0686705 -0.0222188 -0.0079399 0.0792298 -0.0152671 -0.1181304 0.0324884 -0.1314409 -0.0049806 0.0677213 -0.022043 0.0279675 0.0658504 0.0738689 0.0384817 -0.0722434 0.0772949 0.0134658 -0.0985453 0.0653089 -0.0000552 0.0658838 0.0079077 -0.0568534 -0.0242476 -0.0514943 0.0428599 0.1195846 0.011332 -0.0134877 -0.0379613 -0.0163701 0.0044339 0.0136542 0.0185231 -0.0965185 unknown
polarizability: 111.2544878|-2.3112243|80.5143769|-4.432162|3.4229084|79.8979573 unknown
InChI: InChI=1S/C7H13ClO2/c1-2-3-4-7(9)10-6-5-8/h2-6H2,1H3
charge 0 multiplicity 1
23 atoms
Cl 3.509031 1.312272 1.117358
O  1.315576 -0.219838 -0.735221
O  0.200663 -1.33855 0.989812
C  -2.342796 -0.163685 0.101248
C  -3.493626 0.822355 -0.198314
C  -0.973438 0.385931 -0.348741
C  -4.870146 0.274519 0.235407
C  0.189505 -0.494834 0.068686
C  2.58646 -0.890284 -0.375149
C  3.697079 0.146046 -0.351809
H  -2.538879 -1.129427 -0.405134
H  -2.307299 -0.384861 1.184558
H  -3.512041 1.054024 -1.283005
H  -3.296537 1.782179 0.322018
H  -0.799507 1.384375 0.103792
H  -0.931244 0.537722 -1.4426
H  -5.108717 -0.665779 -0.296399
H  -4.885992 0.058476 1.320124
H  -5.678414 0.997747 0.022231
H  2.797531 -1.633963 -1.168116
H  2.470074 -1.410595 0.591445
H  4.681014 -0.333815 -0.232832
H  3.680101 0.787786 -1.244559
