program: Gaussian 09
title: 000021611
version: EM64L-G09RevD.01
frameworkgroup: C1[X(C11H10BrNO2)]
method: RPBEPBE
basis: SDD
operation: Freq
keyword: #p
keyword: freq=noraman
keyword: PBEPBE/SDD
title: #p freq=noraman PBEPBE/SDD
converged: YES YES NO NO
title: Mulliken charges:
elementType: Br O O N C C C C C C C C C C C H H H H H H H H H H
charge: -0.023810 -0.198055 -0.198092 -0.224004 -0.350493 0.183403 0.183137 -0.314336 0.088259 0.088233 -0.351939 -0.351937 -0.689729 -0.209930 -0.209896 0.241659 0.241762 0.252677 0.252914 0.270759 0.270750 0.283985 0.283906 0.240396 0.240384
chargesum: 0.00000
title: Mulliken charges with hydrogens summed into heavy atoms:
elementType: Br O O N C C C C C C C C C C C
charge: -0.023810 -0.198055 -0.198092 -0.224004 0.132927 0.183403 0.183137 0.191254 0.088259 0.088233 -0.081180 -0.081188 -0.121837 0.030465 0.030488
polarizability: 2.01926595e+02 1.06308871e-02 1.42110886e+02 1.77910430e+01 -5.49343684e-02 9.27591010e+01
1716.lowfreq: -23.3909 -6.9034 -4.0853 -0.0004 0.0003 0.0005 8.0888 32.6602 58.3547
frequency: -11.2848 32.6571 58.0392 78.4521 100.9465 137.5645 167.3149 200.9468 224.0148 228.8978 258.8902 329.4160 382.5382 417.8301 455.4514 517.5204 522.7558 582.6785 638.3608 658.7310 676.9953 702.9321 717.9021 751.3178 785.0744 796.3755 802.9362 863.4000 907.3596 954.9612 975.3310 988.8160 1007.0625 1012.3774 1021.9504 1053.8350 1062.9992 1072.9741 1168.4293 1171.0843 1204.2194 1211.9483 1226.6831 1282.6758 1284.6801 1308.2168 1328.3860 1338.0988 1368.0710 1416.1634 1446.0904 1452.8130 1453.7074 1457.6610 1477.3159 1614.4129 1618.0377 1629.6325 1677.8493 3009.6412 3019.9668 3048.0781 3066.5100 3088.9740 3133.1919 3140.3695 3153.6517 3165.0923 3175.0807
redmass: 5.9470 8.3855 1.9953 3.0407 10.3038 4.9775 7.7613 5.8724 6.6537 4.0207 3.3936 10.4744 4.1962 3.5058 4.8668 6.2715 7.2204 9.2493 6.4963 4.8019 5.1836 4.8782 3.2437 1.1577 5.1261 1.6790 1.6337 3.0337 1.3909 6.8952 1.4128 2.0364 1.3479 2.6790 2.9077 1.4175 3.7237 2.6581 1.1999 2.0190 2.8827 1.8338 1.1825 1.2837 1.3363 1.2884 1.2188 3.6715 1.6734 5.9726 1.2024 1.5614 2.4629 1.4275 1.0900 7.6656 7.9548 11.5946 11.7560 1.0588 1.0587 1.0560 1.1040 1.1065 1.1112 1.0865 1.0906 1.0957 1.1004
irintensity: 0.0502 1.0180 1.0039 1.2942 5.4407 0.0011 1.7409 3.8789 3.5428 0.3820 3.2364 20.2873 9.3783 3.1576 0.0000 9.2977 9.2799 15.7964 5.4429 0.0150 0.2099 10.7294 79.7104 10.6047 0.0166 30.7873 2.0660 11.6601 0.0084 23.0725 2.2036 64.9981 0.0075 2.6195 2.9447 23.3668 8.1128 7.1895 9.4789 3.6628 21.2387 15.4331 21.9589 0.7720 0.0141 20.1807 9.7736 304.7159 66.0223 8.6978 11.2696 3.3168 12.0962 18.9644 11.2773 1.5795 88.7664 366.3727 44.7805 7.1173 19.4076 25.9861 0.1445 4.9795 11.2189 1.6376 4.7961 5.4228 20.1286
temp: 298.150 k
press: 1.00000 atm
elementType: 35 8 8 7 6 6 6 6 6 6 6 6 6 6 6 1 1 1 1 1 1 1 1 1 1
symmnumber: 1
zpe: 492169.6 jmol-1
zpe.correction: 0.187458 hartree
zpe.thermalcorrener: 0.200262 hartree
zpe.thermalcorrenthalpy: 0.201206 hartree
zpe.thermalcorrgfe: 0.145767 hartree
zpe.sumelectzpe: -642.790751 hartree
zpe.sumelectthermal: -642.777947 hartree
zpe.sumelectthermalent: -642.777002 hartree
zpe.sumelectthermalfe: -642.832442 hartree
dipole: -4.3449 0.0024 0.3217
dipole: 4.3567
quadrupole: -83.1544 -106.3854 -94.3837
quadrupole: 0.1312 12.3482 0.0712
quadrupole: 11.4868 -11.7443 0.2575 0.1312 12.3482 0.0712
hfenergy: -642.9782089 hartree
pointgroup: C01 [X(C11H10Br1N1O2)]
dipole: 1.6816578 -0.0047061 0.3317521 debye
dipolederiv: -0.5045711 -0.0018318 -0.1433614 -0.0083886 -0.1358878 -0.0056792 -0.3143835 -0.0039626 -0.3161821 -0.6093448 0.2454313 0.0508572 0.0868712 -1.020128 -0.0530621 0.0617436 -0.0467504 -0.333361 -0.6151713 -0.2471597 0.0748311 -0.0878661 -0.9999659 0.1127648 0.0712173 0.1063927 -0.3479468 -1.1749912 0.0035069 0.0588397 0.0073434 -1.1949798 0.0415243 0.1581228 0.0405021 -0.2781707 0.6200662 -0.0062754 -0.0335745 -0.003034 0.1425875 0.0084757 0.0321699 0.007519 0.3222023 -0.4332845 0.1762224 0.0691719 0.1735465 -0.0879846 -0.0480216 0.1116602 -0.0504772 -0.0241904 -0.4391066 -0.1620959 0.0854706 -0.1558845 -0.0723162 0.0512914 0.1277115 0.0528115 -0.0332643 -0.201291 0.0032352 0.0027075 -0.00388 0.087651 -0.0095871 -0.1575149 -0.0071823 -0.1407977 1.2289967 0.0253111 -0.2025588 0.1905325 1.4799953 0.0243953 -0.2611602 -0.0480792 0.2754037 1.2238191 -0.0395121 -0.2010398 -0.2096461 1.4785349 -0.1298137 -0.2428863 -0.0563659 0.2825925 -0.0932458 -0.0753624 0.0101126 0.1058914 0.1370474 -0.0275302 -0.0038124 0.0100827 -0.0972392 -0.0940954 0.0801431 0.0034068 -0.1015214 0.1372504 0.0058051 0.0051873 -0.0316175 -0.0968963 0.6046112 0.0079238 0.3202576 0.0082293 0.1305216 0.0097745 0.3387049 0.0095185 0.4584447 0.1033075 0.1021811 -0.0808487 0.0749784 -0.0437172 -0.0152453 -0.0713196 -0.0324787 -0.1164907 0.0999803 -0.111624 -0.0707045 -0.08368 -0.0360942 0.0093493 -0.0633124 0.0264171 -0.1203566 0.0244345 0.0032923 0.0115762 0.0644428 -0.0051075 -0.1142734 -0.0011749 -0.0466759 0.0346544 0.0235412 -0.0026563 0.0140981 -0.0647208 0.0107409 0.1159444 0.0055001 0.0487943 0.0206912 0.0605593 0.0466583 0.0099365 0.0340981 -0.0257426 -0.0817301 0.0514941 -0.0569621 0.0268756 0.0593766 -0.0474286 0.0159296 -0.0309898 -0.0117602 0.0846791 0.0559927 0.0586845 0.0151983 0.1082092 0.0222664 0.0147975 -0.0206728 -0.0248659 0.0122705 0.0146551 0.0015722 0.1536511 0.108106 -0.0233183 0.0167798 0.0194074 -0.0246312 0.0038303 0.0128907 0.0145791 0.1534547 0.0030203 -0.0002289 -0.0670073 -0.0552939 -0.0039462 0.0872543 -0.0206334 0.0862559 -0.0690134 0.0045258 -0.0056894 -0.068856 0.0528979 -0.0195659 -0.0898941 -0.0271457 -0.0899564 -0.0549448 -0.055131 -0.0699971 0.0581956 -0.0760531 0.0545103 0.0250474 0.0619784 0.0239174 0.1409313 -0.0523212 0.077008 0.0509826 0.0833922 0.0478537 -0.0175696 0.0543148 -0.0165387 0.1447543 unknown
polarizability: 204.5864836|-0.9503569|142.0041284|-4.2074791|-2.4517661|90.2059701 unknown
InChI: InChI=1S/C11H10BrNO2/c12-6-3-7-13-10(14)8-4-1-2-5-9(8)11(13)15/h1-2,4-5H,3,6-7H2
charge 0 multiplicity 1
25 atoms
Br -5.643619 0.002309 -1.49884
O  -0.278278 2.379017 0.422053
O  -0.322791 -2.32425 0.635768
N  -0.630791 0.034697 0.620148
C  -2.051628 0.065165 0.983473
C  1.514046 0.695441 -0.002801
C  1.500708 -0.720107 0.062028
C  -2.964492 0.020879 -0.273919
C  0.148367 1.200061 0.351898
C  0.125794 -1.164679 0.459469
C  2.674476 1.401221 -0.352596
C  2.64758 -1.476388 -0.220397
C  -4.438096 0.054258 0.136034
C  3.840537 0.644866 -0.641847
C  3.827344 -0.771547 -0.576593
H  -2.229757 0.993497 1.555611
H  -2.248822 -0.806037 1.633774
H  -2.753694 -0.899826 -0.846292
H  -2.734039 0.884737 -0.922235
H  2.673234 2.49467 -0.398971
H  2.626054 -2.569268 -0.166396
H  -4.737462 -0.823813 0.729507
H  -4.716686 0.983833 0.656777
H  4.765628 1.160875 -0.919988
H  4.742486 -1.328012 -0.805268
