program: Gaussian 09
title: 000228735
version: EM64L-G09RevD.01
frameworkgroup: C1[X(C15H30O2)]
method: RPBEPBE
basis: SDD
operation: Freq
keyword: #pfreq=noraman
keyword: PBEPBE/SDD
title: #p freq=noraman PBEPBE/SDD
converged: YES YES NO NO
title: Mulliken charges:
elementType: O O C C C C C C C C C C C C C C C H H H H H H H H H H H H H H H H H H H H H H H H H H H H H H
charge: -0.246307 -0.245049 0.030434 -0.448025 -0.443811 -0.444591 -0.029595 -0.409446 -0.415755 -0.385358 -0.012016 -0.718082 -0.345979 -0.730539 -0.722586 -0.697866 0.000197 0.183923 0.196579 0.206138 0.224863 0.209564 0.200876 0.199078 0.251189 0.204601 0.194055 0.207563 0.200369 0.200368 0.201855 0.212661 0.215161 0.212104 0.220179 0.194011 0.192065 0.212394 0.248570 0.200655 0.214242 0.216280 0.204023 0.212865 0.208442 0.215798 0.203899
chargesum: 0.00000
title: Mulliken charges with hydrogens summed into heavy atoms:
elementType: O O C C C C C C C C C C C C C C C
charge: -0.246307 -0.245049 0.214358 -0.045308 -0.009383 -0.044637 0.221594 -0.010790 -0.007822 0.016866 0.200645 -0.070638 0.040097 -0.068921 -0.088041 -0.060762 0.204097
polarizability: 1.83940319e+02 -1.93277912e+00 1.76764313e+02 2.39930916e-01 1.73034298e+00 1.45399274e+02
1716.lowfreq: 0.0004 0.0006 0.0008 4.4882 6.5133 10.0938 12.3638 23.2798 27.0461
frequency: 9.4564 18.9689 24.9120 35.9546 50.5859 60.2443 64.0896 80.7481 97.4899 112.1908 138.3999 159.6311 176.4045 188.1048 200.6340 216.3419 220.5011 237.1578 241.9535 246.2531 273.4346 309.4356 328.8770 332.7634 371.2059 387.8603 406.3420 431.3135 462.5738 482.2679 536.8494 547.0338 713.5202 726.1348 747.1214 755.4186 775.7896 783.5135 814.0922 833.2729 890.9319 893.5206 907.8627 920.0393 923.5420 946.8660 958.8489 963.1345 977.5211 996.2352 1018.2663 1027.2735 1047.3018 1056.8637 1068.2527 1078.7835 1090.3677 1095.2834 1100.6147 1146.1531 1149.0804 1161.0364 1164.4475 1177.1737 1186.1887 1221.7982 1236.7919 1242.7076 1262.9853 1265.1225 1279.8326 1282.0545 1289.4960 1293.9394 1298.0753 1321.0893 1329.4513 1331.7840 1334.3389 1344.2494 1345.2247 1349.1754 1358.7138 1365.1946 1367.5446 1382.9573 1388.3536 1389.5030 1400.7947 1444.5286 1462.5812 1466.4080 1469.2370 1469.3295 1472.6360 1474.5953 1475.4422 1476.9955 1480.8177 1484.1254 1484.8463 1486.3810 1497.0916 1498.0071 1612.7966 2932.2218 2960.1769 2964.0735 2964.9767 2966.3267 2967.1478 2969.4472 2971.1158 2972.4832 2974.4021 2977.5417 2978.5287 2983.0459 2997.9166 3010.5384 3012.4243 3019.3748 3022.1015 3027.9024 3037.0811 3041.2137 3056.3538 3057.2389 3064.6985 3067.4267 3067.8605 3070.6747 3070.9677 3074.2476 3074.4506
redmass: 9.6994 3.8891 3.5951 2.7256 2.9943 2.0428 2.1774 3.0340 2.4897 2.7518 2.2545 2.9554 1.8569 2.6463 2.8501 1.1540 1.1370 2.0187 1.3972 1.3928 2.4659 2.4164 2.9756 2.3509 2.5118 2.7731 2.3779 2.4900 2.3841 2.9557 3.2182 2.3168 5.4784 1.0931 1.3632 2.1589 1.6670 1.2907 2.2870 1.8378 1.7190 1.8865 1.6060 1.5428 1.2478 1.6236 1.5800 1.5499 1.8760 2.2036 2.1876 1.6625 1.9393 2.0693 3.2397 1.7500 2.0293 2.1262 4.3243 2.2075 2.1622 2.1581 2.2896 1.7504 1.6569 1.3557 1.3020 1.3998 1.2505 1.2617 1.2676 1.1428 1.1997 1.1670 1.0885 1.3050 1.4189 1.4053 1.4170 1.1952 1.3603 1.4714 1.4895 1.4580 1.5064 1.2291 1.2203 1.2170 1.2054 1.0872 1.0767 1.0675 1.0635 1.0526 1.0661 1.0506 1.0432 1.0550 1.0738 1.0575 1.0807 1.0784 1.0467 1.0718 8.6754 1.0809 1.0582 1.0585 1.0401 1.0559 1.0510 1.0507 1.0400 1.0544 1.0433 1.0566 1.0770 1.0613 1.0973 1.1002 1.1004 1.0982 1.0948 1.0909 1.1032 1.0944 1.0994 1.0988 1.0987 1.1000 1.1000 1.0991 1.0993 1.0995 1.0993
irintensity: 1.9369 0.2345 0.2018 0.0715 0.1752 0.0740 0.0906 0.5792 0.0396 0.3787 0.1193 0.8272 0.6045 0.8703 4.8167 0.4383 0.1698 2.4669 1.8976 1.1684 3.5002 1.7862 6.6594 1.2977 1.9260 0.5391 2.1049 1.8112 6.1925 5.5712 12.1911 7.9389 1.4472 11.7343 3.5524 6.5526 8.8965 0.0633 2.3337 3.9787 4.6529 15.1849 5.4754 2.4105 6.8519 4.2185 3.3453 0.7150 15.3044 2.4131 6.0521 2.5007 11.0187 6.1617 31.7446 1.2622 42.4684 23.9715 218.7178 6.5785 6.1906 2.5187 1.7200 9.6158 1.2866 1.3879 1.6066 0.6479 2.7666 4.2430 2.1489 3.8330 1.3783 3.0885 0.1765 6.2345 6.1262 6.0151 5.0424 4.4845 3.1151 1.1612 0.7151 5.8127 10.4926 13.3228 12.7996 12.7680 18.6012 2.9965 1.5123 1.7140 3.0361 2.5954 0.6876 6.7803 13.3776 10.4796 2.7338 10.0890 12.5959 23.7679 22.8223 10.9153 244.8662 21.6952 8.8918 1.6370 29.8675 10.2754 39.7873 4.8236 36.8137 52.4603 33.4592 36.9707 27.2554 81.3449 3.5732 1.2158 6.2806 44.6309 7.6761 65.3416 68.1522 39.2434 24.9472 32.2133 79.0836 37.2094 110.6755 49.4012 57.8602 49.5125 55.8153
temp: 298.150 k
press: 1.00000 atm
elementType: 8 8 6 6 6 6 6 6 6 6 6 6 6 6 6 6 6 1 1 1 1 1 1 1 1 1 1 1 1 1 1 1 1 1 1 1 1 1 1 1 1 1 1 1 1 1 1
symmnumber: 1
zpe: 1108551.8 jmol-1
zpe.correction: 0.422225 hartree
zpe.thermalcorrener: 0.444546 hartree
zpe.thermalcorrenthalpy: 0.445491 hartree
zpe.thermalcorrgfe: 0.366846 hartree
zpe.sumelectzpe: -738.624679 hartree
zpe.sumelectthermal: -738.602357 hartree
zpe.sumelectthermalent: -738.601413 hartree
zpe.sumelectthermalfe: -738.680058 hartree
dipole: 0.5335 -2.1076 -0.9961
dipole: 2.3914
quadrupole: -107.3494 -113.6871 -110.3384
quadrupole: 2.8447 2.5074 -5.3741
quadrupole: 3.1089 -3.2288 0.1199 2.8447 2.5074 -5.3741
hfenergy: -739.0469037 hartree
pointgroup: C01[X(C15H30O2)]
dipole: 0.2010888 0.827408 0.400219 debye
polarizability: 183.876095|2.0564603|176.7760603|-0.5542361|2.0867148|145.451751 unknown
InChI: InChI=1S/C15H30O2/c1-5-7-8-14(6-2)9-10-15(17-12-16)11-13(3)4/h12-15H,5-11H2,1-4H3
charge 0 multiplicity 1
47 atoms
O  -2.21319 -1.269345 1.284425
O  -2.247104 -2.924383 -0.387692
C  1.922469 1.505906 0.467124
C  0.533201 1.063953 -0.076257
C  -0.279995 0.182655 0.901484
C  2.864117 0.309193 0.793137
C  -1.65711 -0.217251 0.341567
C  2.55935 2.532543 -0.512838
C  -2.689005 0.920809 0.291746
C  3.265309 -0.579678 -0.407566
C  -4.076973 0.544185 -0.291861
C  3.894864 3.140589 -0.032099
C  4.185672 -1.753579 0.002692
C  -3.988715 0.078269 -1.765756
C  -5.043434 1.744658 -0.15456
C  4.594957 -2.640743 -1.19279
C  -2.438949 -2.538202 0.784873
H  1.74425 2.040614 1.427717
H  -0.0452 1.979363 -0.314257
H  0.665394 0.523362 -1.03605
H  0.279985 -0.746251 1.118582
H  -0.413424 0.712271 1.865927
H  3.786479 0.701489 1.266931
H  2.386714 -0.328782 1.564551
H  -1.538294 -0.698854 -0.646669
H  2.705416 2.057071 -1.503921
H  1.829782 3.35291 -0.672596
H  -2.815984 1.31697 1.319618
H  -2.259274 1.741701 -0.318156
H  3.785186 0.029924 -1.174176
H  2.360655 -0.993161 -0.897954
H  -4.483701 -0.29241 0.312816
H  4.237745 3.934903 -0.720615
H  3.787576 3.589845 0.973733
H  4.696373 2.381723 0.022819
H  3.668478 -2.371722 0.764873
H  5.094008 -1.349482 0.495058
H  -4.997855 -0.128094 -2.167922
H  -3.394629 -0.846665 -1.874646
H  -3.529465 0.863437 -2.398185
H  -5.139792 2.06806 0.898928
H  -6.052499 1.485107 -0.52445
H  -4.682017 2.610159 -0.743792
H  3.705303 -3.081501 -1.681153
H  5.137274 -2.050799 -1.955975
H  5.252996 -3.47099 -0.876669
H  -2.825442 -3.170278 1.607705
