program: Gaussian 09
title: 000228732
version: EM64L-G09RevD.01
frameworkgroup: C1[X(C9H15ClO3)]
method: RPBEPBE
basis: SDD
operation: Freq
keyword: #p
keyword: freq=noraman
keyword: PBEPBE/SDD
title: #p freq=noraman PBEPBE/SDD
converged: YES YES NO NO
title: Mulliken charges:
elementType: Cl O O O C C C C C C C C C H H H H H H H H H H H H H H H
charge: -0.071696 -0.270521 -0.289635 -0.247114 -0.007005 -0.276645 -0.607857 0.296302 -0.489057 -0.294754 -0.659371 -0.060680 -0.555520 0.257282 0.214154 0.215830 0.300057 0.298557 0.242252 0.250287 0.207969 0.194170 0.226418 0.217314 0.233087 0.234550 0.221914 0.219710
chargesum: 0.00000
title: Mulliken charges with hydrogens summed into heavy atoms:
elementType: Cl O O O C C C C C C C C C
charge: -0.071696 -0.270521 -0.289635 -0.247114 0.250276 0.153339 -0.009242 0.296302 0.003483 0.107384 0.017449 0.173871 -0.113896
polarizability: 1.55873684e+02 -1.03944068e+01 9.76250383e+01 -3.08370013e+00 -7.68731624e+00 9.68807850e+01
1716.lowfreq: -7.3149 -3.9338 -0.0017 0.0012 0.0020 11.9190 13.3428 23.8805 36.7889
frequency: 12.6920 23.8255 36.7433 42.4047 57.5904 71.7114 85.2465 117.8986 144.3999 166.7146 188.4660 203.6186 230.2145 252.5287 285.1264 348.3375 419.2563 429.6062 510.7443 529.9146 558.5162 633.4265 641.9645 671.0063 791.8474 815.7270 845.6178 894.5199 914.7389 942.6731 954.9613 972.5366 975.9449 1008.2065 1016.4547 1045.9978 1059.8875 1077.0227 1086.2797 1124.8003 1128.6641 1147.1353 1168.1987 1208.4677 1214.4416 1242.9116 1280.1323 1282.0914 1289.2377 1328.4882 1341.4372 1345.8098 1393.6227 1399.4598 1431.8066 1436.3788 1442.7390 1467.5519 1471.8118 1481.4077 1481.5797 1648.4541 1665.7137 2911.9858 2956.4307 2982.1866 2997.7456 3000.6059 3002.9910 3022.5582 3046.2605 3074.2091 3091.9832 3097.3456 3103.4666 3119.8636 3161.1903 3201.9136
redmass: 2.1479 4.4545 3.0976 5.2281 3.5434 3.5194 3.7152 4.2355 2.8389 2.6139 1.5749 3.1076 4.4709 3.4169 3.2957 3.1706 2.7652 3.0731 2.9706 3.1960 3.5172 1.8579 3.3638 4.4519 1.3587 3.3198 3.4979 2.1623 2.0381 2.3765 1.3558 2.2437 1.6980 1.2468 1.8002 3.1233 2.3459 2.9456 1.6322 2.3578 2.2615 1.4404 1.2575 1.1915 1.2745 1.1742 1.2437 1.2775 1.3743 1.3093 1.6082 1.4794 1.4687 1.2112 1.1132 1.1982 1.0849 1.0986 1.0393 1.0515 1.0753 9.5523 4.7997 1.0602 1.0558 1.0997 1.0551 1.0425 1.0879 1.1014 1.0981 1.0571 1.0604 1.1004 1.1003 1.0945 1.1108 1.1144
irintensity: 0.0908 0.2043 1.2376 1.3251 1.4966 2.6800 2.0087 4.6734 2.0651 2.2762 5.3405 0.8712 3.8887 3.7724 15.3210 15.3901 3.2434 0.1844 3.5055 4.1519 17.1579 2.8610 4.5522 14.4776 13.3700 22.6865 14.1290 5.2698 5.0547 17.4556 87.9152 25.4159 7.4576 41.7696 17.6080 231.8975 27.5446 115.3870 0.3870 273.7485 58.2022 7.1670 5.4108 6.7204 6.8558 0.1488 1.4814 8.9693 11.1198 5.7099 61.2082 14.6907 1.1183 18.9026 26.7198 26.4189 25.7944 4.5377 12.9823 15.0603 10.5100 150.4509 3.0054 55.7009 52.4979 43.2788 30.1130 11.5975 7.1287 26.7677 3.6322 6.1433 10.1108 28.6435 30.2317 8.4716 1.9478 25.5523
temp: 298.150 k
press: 1.00000 atm
elementType: 17 8 8 8 6 6 6 6 6 6 6 6 6 1 1 1 1 1 1 1 1 1 1 1 1 1 1 1
symmnumber: 1
zpe: 593691.4 jmol-1
zpe.correction: 0.226125 hartree
zpe.thermalcorrener: 0.242274 hartree
zpe.thermalcorrenthalpy: 0.243218 hartree
zpe.thermalcorrgfe: 0.177960 hartree
zpe.sumelectzpe: -1036.610703 hartree
zpe.sumelectthermal: -1036.594554 hartree
zpe.sumelectthermalent: -1036.593610 hartree
zpe.sumelectthermalfe: -1036.658868 hartree
dipole: -0.7162 -1.7672 -1.9015
dipole: 2.6929
quadrupole: -74.0273 -88.7859 -86.3216
quadrupole: 0.6069 -4.1877 2.9493
quadrupole: 9.0177 -5.7410 -3.2767 0.6069 -4.1877 2.9493
hfenergy: -1036.836828 hartree
pointgroup: C01 [X(C9H15Cl1O3)]
dipole: 0.2851701 0.774308 -0.6644987 debye
polarizability: 155.8674179|-10.6647852|95.8993263|2.2540207|7.5162851|98.6127626 unknown
InChI: InChI=1S/C9H15ClO3/c1-3-5-12-7-8(6-10)13-9(11)4-2/h3,8H,1,4-7H2,2H3
charge 0 multiplicity 1
28 atoms
Cl -0.088375 -2.609249 -0.653692
O  -1.484317 0.274068 -0.61176
O  2.099457 0.517044 0.117986
O  -2.751112 0.353961 1.346512
C  -0.248143 0.096198 0.198085
C  0.895311 0.541567 -0.717777
C  -0.105021 -1.327146 0.733887
C  -2.693778 0.379648 0.097054
C  -3.856315 0.511785 -0.870565
C  3.326961 0.760382 -0.665092
C  -5.197954 0.763323 -0.1605
C  4.482356 0.843006 0.297212
C  5.640713 0.15273 0.160711
H  -0.303626 0.761835 1.083129
H  0.693858 1.564834 -1.098033
H  0.989584 -0.154589 -1.576591
H  0.863528 -1.427768 1.244867
H  -0.9416 -1.605185 1.388412
H  -3.617171 1.319612 -1.587512
H  -3.891124 -0.417642 -1.472003
H  3.475753 -0.052886 -1.406733
H  3.214774 1.721041 -1.219336
H  -5.175503 1.706982 0.411115
H  -6.016161 0.822233 -0.899436
H  -5.426497 -0.047909 0.551249
H  4.340637 1.534629 1.138964
H  6.466147 0.273796 0.870573
H  5.79832 -0.553501 -0.664029
