program: Gaussian 09
title: 000228726
version: EM64L-G09RevD.01
frameworkgroup: C1[X(C6H10O3)]
method: RPBEPBE
basis: SDD
operation: Freq
keyword: #pfreq=noraman
keyword: PBEPBE/SDD
title: #p freq=noraman PBEPBE/SDD
converged: YES YES NO NO
title: Mulliken charges:
elementType: O O O C C C C C C H H H H H H H H H H
charge: -0.267155 -0.409346 -0.239427 -0.037326 -0.474717 -0.466892 -0.294100 -0.486842 0.186543 0.248466 0.222923 0.260520 0.227316 0.234580 0.223923 0.199256 0.234610 0.261395 0.376273
chargesum: 0.00000
title: Mulliken charges with hydrogens summed into heavy atoms:
elementType: O O O C C C C C C
charge: -0.267155 -0.033072 -0.239427 0.211140 0.008726 -0.004996 0.129080 0.009163 0.186543
polarizability: 8.95032921e+01 -3.12032738e-01 6.80380776e+01 -4.10630307e+00 -1.40714495e+00 5.79388424e+01
1716.lowfreq: -9.0739 -0.0007 -0.0007 -0.0006 14.1618 19.1611 31.5366 57.9548 80.2430
frequency: 25.7257 57.0844 80.1056 147.6825 212.7798 307.2619 362.6683 415.7889 543.6960 581.0319 606.6428 672.3862 695.0684 816.3367 822.7899 857.0253 873.0176 886.9427 920.7385 962.6104 983.4896 1020.8837 1041.7837 1087.2436 1126.9815 1141.3228 1168.5386 1189.7305 1227.4805 1257.3520 1277.3683 1302.9382 1308.9105 1314.2527 1338.6451 1350.8252 1448.5093 1466.6364 1472.7033 1488.8580 1656.4818 2973.2384 3009.2957 3016.8312 3027.2371 3041.6792 3068.5562 3080.4355 3094.3020 3117.2956 3506.1643
redmass: 6.9272 3.0976 4.0394 4.6098 1.9723 6.1658 2.6244 2.1457 3.3697 2.0080 1.5990 2.8555 3.8904 2.4754 3.4106 2.3227 2.7726 2.1508 2.5658 1.6777 2.5341 3.1373 1.8792 1.7230 1.6947 1.3147 1.5422 1.3141 1.3133 1.2381 1.5007 1.4152 1.7157 1.2978 1.3150 1.3820 1.1071 1.0870 1.0937 1.0941 8.3120 1.0663 1.0677 1.0622 1.0812 1.0595 1.0984 1.1021 1.1057 1.1056 1.0639
irintensity: 3.5879 1.2148 3.5995 1.4297 1.1058 5.5440 1.5232 3.5964 56.5530 5.0637 95.3895 40.9408 30.1238 9.7321 2.2460 36.3387 5.7594 18.7117 16.9625 17.5602 39.8404 184.5328 30.0947 49.4584 39.2490 42.1290 5.8289 24.8767 22.1650 2.5438 8.5228 21.3785 70.7738 8.7615 2.2192 5.1080 16.9572 12.1203 15.0728 1.2225 224.1511 85.8611 10.3927 26.3572 29.1947 12.6462 32.4794 8.2518 51.7717 9.7562 21.9122
temp: 298.150 k
press: 1.00000 atm
elementType: 8 8 8 6 6 6 6 6 6 1 1 1 1 1 1 1 1 1 1
symmnumber: 1
zpe: 409442.0 jmol-1
zpe.correction: 0.155948 hartree
zpe.thermalcorrener: 0.165008 hartree
zpe.thermalcorrenthalpy: 0.165952 hartree
zpe.thermalcorrgfe: 0.120148 hartree
zpe.sumelectzpe: -459.586343 hartree
zpe.sumelectthermal: -459.577284 hartree
zpe.sumelectthermalent: -459.576339 hartree
zpe.sumelectthermalfe: -459.622144 hartree
dipole: 0.8149 0.7344 0.8198
dipole: 1.3695
quadrupole: -46.7045 -62.3281 -51.1192
quadrupole: 6.9897 -2.9434 1.4017
quadrupole: 6.6794 -8.9442 2.2648 6.9897 -2.9434 1.4017
hfenergy: -459.7422914 hartree
pointgroup: C01 [X(C6H10O3)]
dipole: -0.3814704 -0.0857682 0.3707204 debye
dipolederiv: -0.9933989 0.1446793 -0.0194928 0.1525006 -0.5131486 0.0589318 -0.1426054 0.0594419 -0.3765857 -0.986874 -0.4264916 -0.111972 -0.4137196 -0.5239521 -0.1493914 -0.2444694 -0.1893909 -0.4268148 -0.5980312 0.08778 -0.098514 -0.0511052 -1.0009412 0.0017861 -0.1477344 0.1784876 -0.3644401 0.8399068 -0.2046992 0.009458 -0.3977504 0.4572875 0.0154585 -0.1052534 0.1082769 0.3185927 -0.077735 -0.0452715 -0.0214923 -0.0274901 -0.0736567 0.0956928 -0.0048405 0.0536835 0.0431871 -0.0119789 0.0137796 -0.0834827 -0.0267233 -0.0427377 0.0532327 -0.018498 0.0839607 0.0636818 0.7318114 -0.1073032 0.0077121 0.1541027 0.2148392 0.0242825 -0.0677121 0.0428561 0.3167782 -0.4471429 0.2472661 -0.0257498 0.3101884 -0.1465406 0.0468064 0.1026638 -0.0415819 -0.0250715 1.3341303 0.1781543 0.3902366 0.2337104 1.3287893 -0.0142123 0.6864903 -0.1755618 0.3427217 -0.0782732 -0.028375 -0.0687426 -0.0441764 -0.0111728 -0.0699078 -0.0519375 -0.0706267 -0.0603727 0.0044753 0.0010179 0.0698729 0.0019725 0.0635135 -0.0882025 0.0504599 -0.0510845 -0.1268379 0.0775254 0.0881308 -0.0413466 0.0767177 -0.0391685 0.0404392 -0.0371396 0.0138492 0.0792087 0.0765697 0.0625727 0.0346739 0.0298702 -0.0208449 -0.085064 0.0057235 -0.1047047 -0.0841824 -0.0960491 -0.0923555 0.0738333 -0.0826863 0.0534484 0.0293265 0.0990698 0.0396588 0.0573276 -0.04168 0.0235161 -0.0762903 0.009562 0.0710927 0.0253036 -0.1376807 0.0533124 -0.1081217 -0.1362032 0.0800766 0.0688106 0.0470272 -0.0224764 -0.0709176 0.1636241 -0.1163562 -0.0545011 0.0498297 -0.0395132 -0.0811063 -0.0278536 0.0057896 -0.0807792 -0.0760169 -0.0352664 0.0287368 0.0482189 -0.0474088 0.0461708 -0.0620071 0.0237744 0.0702118 0.0166713 0.0659318 0.0561066 0.3048989 0.0644447 -0.0725789 0.1178603 0.176105 0.0970028 -0.0908149 0.0851143 0.3205868 unknown
polarizability: 87.8284091|-4.7389143|69.0945167|5.2336106|-3.0227151|58.5572862 unknown
InChI: InChI=1S/C6H10O3/c7-6(8)4-5-2-1-3-9-5/h5,7H,1-4H2
charge 0 multiplicity 1
19 atoms
O  -1.229833 1.312456 -0.559417
O  2.845509 -0.138584 0.284436
O  1.773132 -2.190784 0.111506
C  -0.314879 0.417893 0.196384
C  -1.213703 -0.64978 0.870827
C  -2.455183 -0.705799 -0.058127
C  -2.611929 0.769129 -0.475915
C  0.707528 -0.165716 -0.827629
C  1.78735 -0.962506 -0.134638
H  0.228218 1.04088 0.93059
H  -1.510896 -0.308868 1.879266
H  -0.705859 -1.624193 0.967029
H  -2.254385 -1.342775 -0.938391
H  -3.350616 -1.096782 0.453568
H  -3.079756 0.910424 -1.46485
H  -3.1797 1.344183 0.283629
H  0.177273 -0.825367 -1.53379
H  1.151235 0.679243 -1.377894
H  3.517294 -0.690957 0.770314
