program: Gaussian 09
title: 000228716
version: EM64L-G09RevD.01
frameworkgroup: C1[X(C16H16O3)]
method: RPBEPBE
basis: SDD
operation: Freq
keyword: #pfreq=noraman
keyword: PBEPBE/SDD
title: #p freq=noraman PBEPBE/SDD
converged: YES YES NO NO
title: Mulliken charges:
elementType: O O O C C C C C C C C C C C C C C C C H H H H H H H H H H H H H H H H
charge: -0.261206 -0.235399 -0.236217 -0.037883 -0.284944 0.352771 0.355912 0.339291 -0.400423 -0.371276 -0.692601 -0.358704 -0.397885 -0.397734 -0.395449 -0.234784 -0.236847 -0.244138 0.020621 0.263033 0.226044 0.202739 0.236584 0.240640 0.253271 0.219292 0.222839 0.243441 0.251903 0.236310 0.235094 0.224666 0.224146 0.228906 0.207989
chargesum: 0.00000
title: Mulliken charges with hydrogens summed into heavy atoms:
elementType: O O O C C C C C C C C C C C C C C C C
charge: -0.261206 -0.235399 -0.236217 0.225150 0.143839 0.352771 0.355912 0.339291 -0.163839 -0.130637 0.002801 -0.115264 -0.145981 -0.161425 -0.160355 -0.010118 -0.012701 -0.015233 0.228610
polarizability: 3.08280690e+02 -1.28441573e-01 1.72202748e+02 -1.06735166e+01 2.53951028e+00 9.99717150e+01
1716.lowfreq: -6.0800 -0.0008 -0.0004 0.0004 0.6695 9.0280 20.2780 23.1982 34.9632
frequency: 20.2637 23.1968 34.8790 63.7109 70.4001 75.5349 120.1199 136.1782 170.2996 201.0368 203.9991 212.3706 250.4457 289.1741 330.4577 347.6695 388.9984 405.9500 415.5950 430.5245 467.5968 488.7602 509.8155 549.7630 591.2341 613.8784 635.5072 701.9000 704.0483 725.0509 726.9236 758.1219 769.9004 805.8967 816.3048 839.1810 848.7998 911.9853 915.6344 937.1605 944.4958 960.3347 963.6150 972.1085 986.5897 991.1000 992.3584 996.8450 1015.3326 1040.5729 1067.0464 1084.1963 1096.5964 1116.8502 1125.0565 1157.9852 1172.9000 1183.0926 1195.4708 1229.6526 1230.7843 1291.2207 1303.7774 1305.3519 1313.6237 1328.3195 1343.1127 1356.9205 1374.3575 1385.9519 1394.1552 1422.3640 1439.1964 1457.1370 1468.0475 1476.2994 1478.6182 1514.0582 1570.9789 1588.3442 1612.3295 1621.0915 1624.1649 2962.0517 2994.1032 3025.5736 3041.0569 3052.1802 3091.4269 3106.3452 3121.0569 3124.9486 3134.1512 3137.6310 3140.5715 3147.3283 3162.6388 3164.1419 3168.2112
redmass: 7.1515 7.3982 4.2522 5.0039 3.9108 4.7534 4.4380 4.1462 5.7904 2.1516 1.8728 2.4213 3.3352 2.8947 4.2127 4.7056 3.8766 2.8491 3.0262 3.7043 3.9243 3.3517 3.3849 2.4691 7.1751 6.4852 6.8025 1.7477 5.5841 3.2791 4.9021 4.0972 1.9184 5.5519 1.3637 1.5713 1.2551 1.6667 1.4272 1.4740 1.4519 1.5992 1.3656 1.4302 5.3173 5.2655 1.3219 5.4240 2.8066 1.8901 2.1050 1.6239 7.8981 1.9589 1.5509 1.6845 1.0523 1.2427 1.1927 1.2915 2.1368 2.8789 1.4107 1.3660 1.4056 1.2314 1.1229 2.7740 6.1910 1.5500 1.3064 3.9594 2.4251 1.1191 1.0965 1.8525 1.0820 2.7952 6.1457 6.6673 6.0391 7.4854 7.1821 1.0559 1.0364 1.1044 1.0919 1.0882 1.0989 1.1003 1.0844 1.0873 1.0883 1.0898 1.0900 1.0961 1.0946 1.1013 1.0963
irintensity: 0.5102 0.4669 1.0694 0.5125 0.1592 0.2118 0.3459 2.9985 3.5892 1.8698 3.5343 3.3325 6.5304 6.7531 1.6712 4.1596 2.0473 0.3107 0.8279 3.8253 18.3057 8.6765 11.1402 4.8210 31.5123 0.1390 1.0963 47.7715 1.0227 8.1964 3.9440 4.7327 85.8232 18.6812 13.4926 49.1585 0.0087 3.4828 1.7727 1.2190 0.6868 2.7205 0.2557 0.4827 23.2721 19.2149 0.0831 67.1281 9.7519 11.8489 78.5124 7.9863 341.1105 17.4835 2.3839 33.7724 0.0573 94.3225 40.1582 58.1296 187.1338 12.5866 5.9245 0.9917 2.3318 15.4013 2.5419 7.6832 0.9393 2.2021 33.4837 4.8353 4.0173 47.3522 64.7157 80.7353 14.0855 69.1656 6.9306 7.7210 40.2613 278.8726 71.4357 43.1469 18.9987 20.7496 54.9976 8.5494 31.5704 16.2579 10.1655 0.6212 17.7506 18.8416 0.5211 43.3789 23.7979 26.5198 2.7667
temp: 298.150 k
press: 1.00000 atm
elementType: 8 8 8 6 6 6 6 6 6 6 6 6 6 6 6 6 6 6 6 1 1 1 1 1 1 1 1 1 1 1 1 1 1 1 1
symmnumber: 1
zpe: 731361.5 jmol-1
zpe.correction: 0.278561 hartree
zpe.thermalcorrener: 0.296087 hartree
zpe.thermalcorrenthalpy: 0.297032 hartree
zpe.thermalcorrgfe: 0.230384 hartree
zpe.sumelectzpe: -843.596368 hartree
zpe.sumelectthermal: -843.578842 hartree
zpe.sumelectthermalent: -843.577897 hartree
zpe.sumelectthermalfe: -843.644545 hartree
dipole: -0.6915 2.7419 1.1191
dipole: 3.0412
quadrupole: -112.8414 -99.7466 -116.1270
quadrupole: 13.2391 6.6595 -2.9321
quadrupole: -3.2698 9.8251 -6.5553 13.2391 6.6595 -2.9321
hfenergy: -843.8749291 hartree
pointgroup: C01 [X(C16H16O3)]
dipole: 0.281862 1.0079326 -0.5798279 debye
polarizability: 308.7256963|-0.0561206|170.0534705|-4.5649516|-12.5790483|101.6759868 unknown
InChI: InChI=1S/C16H16O3/c1-13(19-12-17)11-18-16-9-7-15(8-10-16)14-5-3-2-4-6-14/h2-10,12-13H,11H2,1H3
charge 0 multiplicity 1
35 atoms
O  -2.275576 -0.16451 0.250808
O  -4.832895 -0.55907 -1.133306
O  -6.373029 -1.571995 0.320411
C  -4.546346 0.533109 -0.137314
C  -3.08268 0.903802 -0.348507
C  1.976085 -0.080036 0.037139
C  -0.878295 -0.070127 0.140694
C  3.46544 -0.089872 -0.018933
C  1.221656 0.976961 -0.535237
C  1.254863 -1.13586 0.666987
C  -5.508632 1.700361 -0.392136
C  -0.189186 0.994436 -0.490465
C  -0.148536 -1.136784 0.720667
C  4.186788 -1.313386 -0.10926
C  4.210827 1.122052 0.014485
C  5.596857 -1.325593 -0.162124
C  5.620718 1.112087 -0.043395
C  6.323162 -0.112433 -0.130804
C  -5.744313 -1.532831 -0.755779
H  -4.692619 0.111501 0.873251
H  -2.865626 0.994747 -1.431681
H  -2.866418 1.871391 0.150238
H  1.740926 1.789319 -1.055976
H  1.803405 -1.953648 1.147155
H  -6.552083 1.364611 -0.274427
H  -5.32832 2.511555 0.336437
H  -5.381895 2.107011 -1.411137
H  -0.728484 1.82517 -0.955313
H  -0.699432 -1.944066 1.212624
H  3.638296 -2.260352 -0.169956
H  3.683616 2.077451 0.118576
H  6.128505 -2.280877 -0.238985
H  6.172003 2.05867 -0.008127
H  7.417899 -0.121123 -0.173185
H  -5.820083 -2.271069 -1.576226
