program: Gaussian 09
title: 000228712
version: EM64L-G09RevD.01
frameworkgroup: C1[X(C17H18O3)]
method: RPBEPBE
basis: SDD
operation: Freq
keyword: #pfreq=noraman
keyword: PBEPBE/SDD
title: #p freq=noraman PBEPBE/SDD
converged: YES YES NO NO
title: Mulliken charges:
elementType: O O O C C C C C C C C C C C C C C C C C H H H H H H H H H H H H H H H H H H
charge: -0.259430 -0.270278 -0.254153 -0.007814 -0.298358 0.352626 0.357034 -0.704610 0.339320 -0.401046 -0.371508 -0.358084 -0.399739 -0.398018 -0.395283 -0.234941 -0.237157 0.300821 -0.244504 -0.754938 0.257979 0.224129 0.202131 0.256067 0.217621 0.219296 0.236044 0.239856 0.244803 0.251190 0.235850 0.234987 0.224349 0.223938 0.228697 0.253479 0.245592 0.244051
chargesum: 0.00000
title: Mulliken charges with hydrogens summed into heavy atoms:
elementType: O O O C C C C C C C C C C C C C C C C C
charge: -0.259430 -0.270278 -0.254153 0.250165 0.127902 0.352626 0.357034 -0.011627 0.339320 -0.165002 -0.131652 -0.113281 -0.148550 -0.162167 -0.160297 -0.010591 -0.013218 0.300821 -0.015807 -0.011816
polarizability: 3.19434992e+02 6.38458603e+00 1.82125365e+02 -1.41763134e+01 1.13544287e+01 1.14619997e+02
1716.lowfreq: -10.5938 -5.1922 -2.2334 -0.0008 -0.0007 -0.0003 15.8083 21.3614 29.8015
frequency: 15.7212 21.2428 29.7636 47.9859 60.4887 66.0943 72.0259 95.9964 129.0449 144.9166 168.7192 201.5958 202.9789 219.3343 258.0937 319.7395 328.7392 370.4368 405.4106 408.7549 415.2460 436.2681 454.9699 486.4175 507.7428 548.9070 568.9400 586.4623 614.1675 616.5518 635.3346 701.1909 709.1867 724.7899 767.3124 769.7412 804.6730 814.0564 837.3553 847.5628 892.7180 914.5605 924.4279 936.3288 943.6818 961.4850 971.4635 986.2005 990.6716 991.6194 993.7299 999.9222 1014.9822 1040.7024 1042.6642 1070.6563 1083.9303 1115.2271 1122.9854 1154.9925 1172.7929 1181.5259 1194.3056 1204.6369 1230.9057 1231.8445 1289.8457 1300.8779 1302.7902 1312.8702 1333.8867 1356.0034 1374.1894 1383.1965 1384.7144 1392.2971 1422.0487 1439.1715 1452.8615 1455.5602 1456.6723 1466.9184 1476.5164 1478.9978 1513.3702 1569.6558 1587.8684 1612.5544 1622.4654 1650.0922 2961.5344 2992.0181 3007.5744 3024.5128 3049.9316 3088.5352 3098.5246 3105.9882 3121.0464 3125.0593 3133.2607 3136.1188 3140.1404 3141.9617 3147.5830 3160.6396 3164.1164 3167.6349
redmass: 5.7924 5.4774 4.4696 1.0903 4.0516 4.2968 4.0506 4.1640 4.0701 3.6040 5.9369 1.5717 4.1310 2.0683 2.5482 4.3697 5.0676 4.3920 2.8827 3.6169 2.9626 3.4999 3.3416 3.3163 3.3598 2.4519 3.4024 6.0254 6.4167 4.5830 6.7735 1.7230 5.8817 3.2550 2.8929 2.1200 5.7368 1.3582 1.5880 1.2560 2.5629 1.4301 2.6436 1.4728 1.4998 1.3659 1.4239 5.1123 4.7650 1.3301 2.8635 2.7564 2.8017 1.8821 1.6595 2.1621 1.6224 1.8733 1.5887 1.7386 1.0520 1.2560 1.1892 2.9086 1.8141 1.5188 2.8273 1.4172 1.3865 1.4074 1.2674 2.7832 5.4957 1.3599 1.4737 1.2895 4.0141 2.4255 1.0597 1.0542 1.1193 1.0942 1.9285 1.0613 2.8146 6.2494 6.5961 6.0627 6.4175 9.3737 1.0558 1.0365 1.0374 1.1042 1.0882 1.0989 1.0959 1.1000 1.0844 1.0873 1.0881 1.0892 1.0910 1.1016 1.0961 1.0949 1.1014 1.0962
irintensity: 0.2643 0.1374 1.1007 0.9982 1.3603 0.2179 0.3451 2.3603 1.6687 3.1958 3.5637 1.7874 3.5997 1.1758 2.4590 0.3601 1.0023 5.3558 0.4124 0.9226 0.8338 5.4573 6.0922 5.8889 12.9020 4.7984 4.0092 27.6876 0.1968 9.4323 1.1778 48.7046 2.8793 8.5284 9.9916 78.2294 13.7097 10.4415 48.0744 0.0052 34.5323 1.6302 39.8779 4.5551 6.7023 0.3485 0.4003 33.3383 29.9944 0.1140 55.8834 53.6110 7.8771 10.4928 12.7766 73.7735 8.4018 6.3293 9.1978 108.1128 0.0648 115.7393 52.0950 368.2998 117.7573 67.0650 13.3934 1.9944 4.3422 2.0365 1.1387 7.6271 0.5475 31.6164 27.8135 33.3125 5.5313 4.1112 28.4753 34.0500 31.4790 61.1805 84.9013 12.1769 63.6402 7.3574 7.0911 37.4569 75.8795 194.9371 40.9650 21.8631 2.1683 20.0766 11.8165 35.1934 9.0080 16.2737 10.3427 0.8417 16.3479 18.9199 3.0938 11.2535 43.1442 21.2644 28.5150 3.2420
temp: 298.150 k
press: 1.00000 atm
elementType: 8 8 8 6 6 6 6 6 6 6 6 6 6 6 6 6 6 6 6 6 1 1 1 1 1 1 1 1 1 1 1 1 1 1 1 1 1 1
symmnumber: 1
zpe: 802601.7 jmol-1
zpe.correction: 0.305695 hartree
zpe.thermalcorrener: 0.325040 hartree
zpe.thermalcorrenthalpy: 0.325984 hartree
zpe.thermalcorrgfe: 0.254307 hartree
zpe.sumelectzpe: -882.834612 hartree
zpe.sumelectthermal: -882.815267 hartree
zpe.sumelectthermalent: -882.814323 hartree
zpe.sumelectthermalfe: -882.886000 hartree
dipole: -0.4599 1.6230 2.0435
dipole: 2.6498
quadrupole: -117.8379 -102.1693 -123.3298
quadrupole: 5.5143 10.8438 -0.1532
quadrupole: -3.3922 12.2764 -8.8841 5.5143 10.8438 -0.1532
hfenergy: -883.1403067 hartree
pointgroup: C01 [X(C17H18O3)]
dipole: -0.1806241 1.0130909 -0.166776 debye
polarizability: 317.7670282|-12.3967058|139.8548441|-20.0653015|-33.9025888|158.5584807 unknown
InChI: InChI=1S/C17H18O3/c1-13(20-14(2)18)12-19-17-10-8-16(9-11-17)15-6-4-3-5-7-15/h3-11,13H,12H2,1-2H3
charge 0 multiplicity 1
38 atoms
O  1.90965 -0.430305 -0.486927
O  4.608808 0.472873 0.226529
O  6.118903 -1.301873 0.070874
C  4.134689 0.199318 -1.169254
C  2.666859 0.610997 -1.192329
C  -2.300851 -0.083017 0.047132
C  0.524584 -0.247972 -0.347142
C  4.996366 0.997213 -2.157302
C  -3.774089 0.003619 0.255921
C  -1.592509 0.932905 -0.645861
C  -1.548451 -1.189747 0.538057
C  -0.197336 0.863483 -0.848247
C  -0.159523 -1.275961 0.347706
C  -4.381528 -0.536266 1.424226
C  -4.61756 0.630717 -0.703873
C  -5.775884 -0.454476 1.624985
C  -6.011458 0.718103 -0.502462
C  5.596778 -0.379638 0.737082
C  -6.600108 0.17481 0.663263
C  5.899786 -0.027121 2.176584
H  4.232367 -0.885831 -1.352544
H  2.53819 1.590516 -0.689674
H  2.315933 0.689599 -2.242186
H  6.053152 0.699566 -2.058677
H  4.68097 0.792683 -3.196756
H  4.916217 2.083135 -1.971202
H  -2.132821 1.814237 -1.009197
H  -2.063924 -2.00949 1.050567
H  0.30669 1.676034 -1.379794
H  0.413748 -2.131896 0.716506
H  -3.753528 -0.996017 2.195832
H  -4.182688 1.024964 -1.629651
H  -6.218021 -0.871818 2.536857
H  -6.640007 1.199388 -1.260412
H  -7.682596 0.240077 0.819155
H  5.074278 -0.377637 2.822028
H  5.977198 1.065075 2.302684
H  6.832819 -0.517251 2.490404
