program: Gaussian 09
title: 000228709
version: EM64L-G09RevD.01
frameworkgroup: C1[X(C10H11IO3)]
method: RPBEPBE
basis: SDD
operation: Freq
keyword: #p
keyword: freq=noraman
keyword: PBEPBE/SDD
title: #p freq=noraman PBEPBE/SDD
converged: YES YES NO NO
title: Mulliken charges:
elementType: I O O O C C C C C C C C C C H H H H H H H H H H H
charge: 0.100791 -0.280224 -0.243196 -0.217084 -0.277499 -0.325566 0.363606 -0.346585 -0.371819 -0.220599 -0.195270 -0.254775 0.363920 -0.862838 0.216916 0.246099 0.249238 0.250552 0.245609 0.250315 0.224695 0.228873 0.229143 0.313866 0.311832
chargesum: 0.00000
title: Mulliken charges with hydrogens summed into heavy atoms:
elementType: I O O O C C C C C C C C C C
charge: 0.100791 -0.280224 -0.243196 -0.217084 0.185515 0.174223 0.363606 -0.100976 -0.121504 0.004096 0.033604 -0.025632 0.363920 -0.237140
polarizability: 2.10697137e+02 -1.33356910e+01 1.23029384e+02 -2.68138271e+00 -5.96428878e+00 7.52703003e+01
1716.lowfreq: -14.7127 -5.4620 -3.2265 -0.0007 -0.0007 -0.0006 14.7921 25.8692 29.5876
frequency: 14.6201 25.5625 29.2098 44.3106 66.2032 106.6411 132.3835 136.6860 227.9682 253.2909 267.2320 313.5955 402.3633 411.5727 462.7791 491.8783 500.8135 568.5177 609.9781 639.6424 691.2599 714.7026 757.7548 763.5140 803.9193 817.9985 836.2065 872.4109 890.7597 961.2753 976.5088 980.6003 983.4214 992.7764 1022.3566 1072.2993 1082.5076 1091.0655 1120.7649 1167.7290 1177.9125 1198.0509 1206.0522 1212.9240 1226.5496 1279.1119 1313.2665 1326.5412 1380.8924 1395.3149 1424.6379 1443.4466 1455.8690 1474.4926 1492.0111 1593.2370 1611.6822 1638.5188 2971.8541 3039.3399 3048.3870 3087.6622 3129.7230 3135.6612 3138.3997 3155.3108 3163.6436 3173.6891 3185.8837
redmass: 7.6549 7.5644 4.2071 7.6031 5.6347 7.7454 2.4268 5.8264 5.1189 5.2338 2.7698 4.8913 3.5398 2.9168 7.0111 4.6679 2.8733 7.1160 6.4416 4.7798 2.0572 7.3485 1.6578 3.6520 4.4843 1.2419 1.2096 1.8390 1.4460 1.3622 6.5333 6.1825 1.3079 7.4441 2.0380 1.6863 1.5425 2.8247 1.5705 1.0859 1.1664 1.1627 1.2017 2.7980 2.9727 1.1199 1.3271 1.2616 2.3896 2.2925 1.1237 2.3373 1.0937 1.9244 1.1890 6.4491 6.2977 9.8681 1.0557 1.1056 1.0605 1.0555 1.0848 1.1084 1.0888 1.0924 1.0959 1.1008 1.1118
irintensity: 0.1706 0.2357 0.2746 0.8982 1.0278 0.2202 5.3476 0.3391 0.2067 0.3569 16.4446 9.1647 9.7017 0.0386 12.2925 6.5775 11.9014 13.4866 0.3841 11.1836 33.7452 2.5060 97.5242 14.0874 9.1248 0.4596 1.3569 7.3803 8.5244 0.1492 55.3784 39.3507 1.1097 52.0858 28.4047 151.3696 11.6898 29.2759 0.3930 12.1263 47.7007 11.8365 2.7979 480.2781 39.8296 9.1306 0.8580 3.8256 1.3800 14.4152 23.0537 3.2454 14.4433 131.5636 0.9677 26.6341 74.8673 177.1850 27.8181 19.5361 16.0787 3.5251 3.0960 9.1631 10.0485 33.2383 20.7363 6.7250 0.0153
temp: 298.150 k
press: 1.00000 atm
elementType: 53 8 8 8 6 6 6 6 6 6 6 6 6 6 1 1 1 1 1 1 1 1 1 1 1
symmnumber: 1
zpe: 498753.9 jmol-1
zpe.correction: 0.189965 hartree
zpe.thermalcorrener: 0.204102 hartree
zpe.thermalcorrenthalpy: 0.205047 hartree
zpe.thermalcorrgfe: 0.143372 hartree
zpe.sumelectzpe: -623.781587 hartree
zpe.sumelectthermal: -623.767450 hartree
zpe.sumelectthermalent: -623.766506 hartree
zpe.sumelectthermalfe: -623.828180 hartree
dipole: -0.6714 1.2191 -1.8906
dipole: 2.3476
quadrupole: -91.6095 -88.6553 -104.4874
quadrupole: -0.3484 -1.4825 -4.4680
quadrupole: 3.3079 6.2621 -9.5700 -0.3484 -1.4825 -4.4680
hfenergy: -623.9715526 hartree
pointgroup: C01 [X(C10H11I1O3)]
dipole: 0.2188962 -0.580766 -0.6840239 debye
dipolederiv: -0.2597945 0.0231865 -0.0180201 0.07943 -0.0766092 -0.0047473 -0.0114745 -0.0087079 -0.0365757 -2.0242805 0.1488359 0.015576 0.3029442 -0.3247891 -0.0122522 -0.0274292 0.0012758 -0.2757467 -1.2786245 -0.2454677 0.295723 -0.585108 -0.4781232 0.279256 0.5183239 0.2294279 -0.7284932 -0.6783274 -0.0026379 -0.1926296 -0.229354 -0.3120366 0.0339427 0.0820705 0.2274196 -0.8670207 0.9076338 0.0751309 -0.0092046 0.3539992 0.1592433 0.0600181 0.0135189 -0.0048461 0.3560312 0.768852 0.1086754 -0.1092807 0.2296155 0.3657716 -0.0825628 0.0069505 0.0310571 0.225131 1.5947875 -0.283006 -0.0019325 -0.6441247 0.1690018 0.003611 0.016866 -0.0030418 0.1104966 -0.262226 0.0142041 0.0040557 0.395109 -0.1337234 0.0066142 0.0138365 -0.0008131 -0.2111071 -0.4560033 0.092174 0.0074245 -0.1085347 0.0582352 0.0049083 -0.0120224 0.0136764 -0.1863701 0.1420236 0.0670366 0.0088623 -0.061221 0.1512012 0.011088 0.0048729 0.0120637 -0.1386016 0.163903 -0.0184534 0.0056376 0.0103211 0.1508261 0.0149226 0.0087453 0.0119271 -0.1418963 -0.052256 -0.0921699 0.0029211 -0.0350134 -0.1879262 -0.0023875 0.0039481 -0.0022674 -0.1974416 1.4981578 0.2591285 -0.0134106 0.8882415 0.3108103 -0.321476 -0.4917073 -0.4780322 1.3138891 -0.0384958 -0.2449326 -0.0681026 -0.3523534 0.1837342 0.0334575 -0.0788082 0.0217216 -0.0100255 -0.0286292 0.0165568 0.0163918 -0.0927866 -0.0169591 -0.091043 -0.0239688 -0.0969417 -0.081257 0.0121001 0.011402 -0.0160384 -0.1027383 -0.0233776 0.0657012 -0.0018785 0.0886584 -0.0335574 0.0207809 -0.0236834 0.0058066 -0.0301455 0.0119757 0.0757884 -0.0035609 0.0972906 0.0108399 -0.0164091 -0.0073544 0.0469709 -0.0052337 0.0408165 -0.0253553 -0.0033582 -0.1079681 -0.0153288 -0.0299131 -0.0959701 -0.0102966 -0.122554 0.0352177 -0.00581 -0.0100021 -0.0061112 0.1673785 0.1009749 0.0482768 -0.001435 0.0390536 -0.0567996 -0.0086401 -0.0004563 -0.0079086 0.1717568 0.0669554 0.030873 -0.0001886 0.0558447 -0.1169428 -0.0106168 -0.0005011 -0.0099493 0.1551737 -0.0516544 -0.103981 -0.008377 -0.1101539 -0.0017621 -0.0091293 -0.0101201 -0.0092015 0.1559205 -0.1136494 0.0680954 -0.0038822 0.0699029 0.0624378 -0.0028938 -0.0049612 -0.0024949 0.1729816 -0.0157758 0.0765098 -0.0144192 0.0138238 -0.0197537 0.0444918 0.020851 0.0546802 0.0746094 0.02987 0.0775706 0.0578482 0.0410355 0.0495311 -0.0568858 -0.009735 -0.0509146 0.0092131 unknown
polarizability: 210.1678046|-14.8842307|124.4023992|-1.9328243|0.0176296|74.4266174 unknown
InChI: InChI=1S/C10H11IO3/c11-8-10(12)14-7-6-13-9-4-2-1-3-5-9/h1-5H,6-8H2
charge 0 multiplicity 1
25 atoms
I  -6.240975 0.324133 0.313331
O  0.944108 0.893222 -0.123535
O  -2.664522 0.154618 -0.490297
O  -2.804908 -0.519219 1.745558
C  -0.210759 -0.008389 -0.197676
C  -1.427021 0.924874 -0.185024
C  2.228776 0.315095 -0.11167
C  2.476577 -1.078245 -0.162053
C  3.302842 1.236287 -0.045717
C  3.814035 -1.54039 -0.145238
C  4.627926 0.75899 -0.030381
C  4.892903 -0.632362 -0.080147
C  -3.279141 -0.486889 0.58865
C  -4.573903 -1.127301 0.1457
H  -0.185299 -0.597355 -1.136853
H  -0.231426 -0.693247 0.671955
H  -1.356581 1.667913 -0.992937
H  -1.531713 1.420396 0.794799
H  1.655901 -1.800245 -0.210485
H  3.077879 2.306569 -0.00704
H  4.006403 -2.618578 -0.182692
H  5.456307 1.474254 0.021051
H  5.924349 -0.999389 -0.06713
H  -4.847445 -1.954341 0.812636
H  -4.55201 -1.420701 -0.911906
