program: Gaussian 09
title: 000228708
version: EM64L-G09RevD.01
frameworkgroup: C1[X(C8H15IO2)]
method: RPBEPBE
basis: SDD
operation: Freq
keyword: #p
keyword: freq=noraman
keyword: PBEPBE/SDD
title: #p freq=noraman PBEPBE/SDD
converged: YES YES NO NO
title: Mulliken charges:
elementType: I O O C C C C C C C C H H H H H H H H H H H H H H H
charge: 0.082175 -0.238627 -0.224970 -0.363606 -0.350982 -0.370032 -0.354079 -0.315882 -0.694003 0.359781 -0.861582 0.197017 0.188141 0.190923 0.195244 0.214120 0.232509 0.196530 0.194560 0.226126 0.234443 0.216592 0.210259 0.211710 0.312227 0.311405
chargesum: 0.00000
title: Mulliken charges with hydrogens summed into heavy atoms:
elementType: I O O C C C C C C C C
charge: 0.082175 -0.238627 -0.224970 0.021551 0.035185 0.076597 0.037011 0.144687 -0.055441 0.359781 -0.237950
polarizability: 1.31320260e+02 -7.78248380e+00 1.20121665e+02 5.97834857e-01 2.06138452e+00 8.66386792e+01
1716.lowfreq: -4.3558 -2.6548 0.0004 0.0006 0.0006 10.9741 24.7826 34.0490 41.2064
frequency: 24.7328 33.8097 41.1437 53.6931 75.3951 94.6564 119.6598 134.0963 156.4935 227.2406 248.3134 263.4163 272.2459 388.5710 415.9096 450.8816 501.8452 637.1707 715.0821 728.1599 750.0176 772.7371 803.1952 867.5965 887.7595 892.6921 951.0031 993.0003 1009.5020 1040.3361 1065.5276 1077.7455 1081.8050 1121.6357 1167.1272 1197.3819 1204.8627 1221.2895 1239.7075 1255.3442 1284.3788 1292.8759 1295.2454 1299.6302 1341.5190 1356.8988 1368.3211 1387.9105 1421.3211 1453.8002 1465.6007 1466.7011 1474.8663 1476.4224 1483.3779 1489.5053 1631.4102 2955.0638 2959.1016 2969.0260 2972.6546 2992.1833 2993.9791 3008.3492 3021.5511 3032.7228 3055.4133 3069.5366 3072.2127 3087.2310 3104.8493 3185.5625
redmass: 7.1526 2.9569 2.9839 2.4631 3.2780 4.7217 1.7482 2.2382 6.5850 1.1151 3.6964 4.0598 2.8073 3.1632 3.0987 4.6713 4.5533 4.6646 6.7886 1.0700 1.1103 2.4400 1.3091 1.6949 1.7842 1.3990 5.9025 1.1790 3.8458 3.3019 2.8117 1.5119 2.2126 2.6363 1.7662 1.1808 1.4343 2.6002 1.2752 1.2742 1.0692 1.1639 1.1605 1.1829 1.4016 1.6194 1.3880 1.2164 1.1241 1.0968 1.0671 1.0753 1.0702 1.0436 1.0804 1.0930 9.4663 1.0588 1.0589 1.0595 1.0361 1.0781 1.0788 1.1016 1.0584 1.1042 1.1037 1.1008 1.0993 1.0553 1.1080 1.1119
irintensity: 0.2525 0.4575 0.5707 0.5609 0.8129 0.1295 0.1175 0.1473 0.9046 0.0312 0.4931 4.1377 11.3027 6.8355 0.2059 5.9717 16.0941 11.0855 0.7549 11.5784 1.5678 6.2452 1.1094 3.8082 10.1064 3.6683 68.5822 1.0615 4.3375 15.0646 6.2788 148.1353 4.6969 8.9470 3.1013 9.5215 0.4583 247.5944 7.2829 6.2535 2.5547 0.1083 4.3115 1.8355 1.1191 0.9956 0.6945 11.3810 22.1309 11.2234 0.5756 0.4000 1.8968 12.3849 2.5158 25.3867 179.4379 2.4826 4.6659 90.0393 37.2141 9.2944 13.4794 0.5340 46.8932 39.5241 30.0349 93.3678 53.0222 4.3603 27.6150 0.0230
temp: 298.150 k
press: 1.00000 atm
elementType: 53 8 8 6 6 6 6 6 6 6 6 1 1 1 1 1 1 1 1 1 1 1 1 1 1 1
symmnumber: 1
zpe: 572126.0 jmol-1
zpe.correction: 0.217911 hartree
zpe.thermalcorrener: 0.232004 hartree
zpe.thermalcorrenthalpy: 0.232948 hartree
zpe.thermalcorrgfe: 0.172356 hartree
zpe.sumelectzpe: -474.906141 hartree
zpe.sumelectthermal: -474.892048 hartree
zpe.sumelectthermalent: -474.891104 hartree
zpe.sumelectthermalfe: -474.951696 hartree
dipole: -1.2814 0.8766 -1.6434
dipole: 2.2608
quadrupole: -76.2248 -79.6964 -87.8977
quadrupole: 1.5285 0.5130 -3.1860
quadrupole: 5.0482 1.5766 -6.6247 1.5285 0.5130 -3.1860
hfenergy: -475.1240519 hartree
pointgroup: C01 [X(C8H15I1O2)]
dipole: -0.3866328 -0.2255464 0.7686311 debye
dipolederiv: -0.0992651 -0.0134438 -0.0048126 -0.1006936 -0.2451462 0.0506828 0.0214585 0.0547836 -0.0608367 -1.2419819 -0.2853452 0.4397374 -0.1789333 -0.402272 0.0182356 0.5951391 0.0976749 -0.8755607 -0.5367981 -0.2883044 -0.0189809 0.0116283 -0.5549881 -0.286658 0.2695369 -0.2180621 -0.7466419 -0.0148969 0.0197695 -0.0393323 0.1011807 0.1352987 0.00934 -0.0903625 0.0259903 0.1855715 -0.0369693 -0.0175536 -0.0192984 -0.0788352 0.0828549 0.0556458 0.0045139 0.0505014 0.1432906 -0.1654958 -0.035203 -0.0050727 -0.0252391 0.0135725 0.134946 -0.0429863 0.0598512 0.0603069 0.03668 0.0053334 -0.0261788 0.0662082 0.1215702 0.030612 -0.0595396 0.0281554 0.1559822 0.7859357 0.1350431 -0.1636107 0.1598169 0.3561747 -0.1572228 -0.0432763 -0.0413735 0.3201988 -0.0671163 0.0378773 -0.0454334 0.0028748 0.0545947 0.0258603 -0.0302427 0.0289328 0.0720753 1.0907125 0.7591823 -0.4560073 0.2195939 0.6380063 0.3370353 -0.8602131 0.2000537 1.2593527 -0.131197 -0.25637 0.0766014 -0.179579 0.2545428 -0.1250167 0.0540289 -0.1300913 0.0530321 0.0451208 0.0138838 0.0023959 0.0028662 -0.1492684 -0.0710021 0.0021276 -0.0999506 0.0268958 0.0302575 -0.017167 0.0394628 -0.0139883 0.0499159 0.0414722 0.0489818 0.0713185 -0.177355 0.0370243 0.0038609 -0.0043241 0.010291 -0.1532004 -0.0809614 -0.0056356 -0.102668 0.022193 0.0275874 -0.0131527 0.049142 -0.0035128 0.0509577 0.0407133 0.0439505 0.0619317 -0.1635332 0.0565652 0.0149674 -0.0067147 0.0055874 -0.1127429 -0.0727477 -0.0139722 -0.0813706 0.0327892 0.0643825 0.0014556 0.0259994 -0.0023406 0.0520591 0.0289238 0.0484325 0.0583918 -0.1060783 0.0297146 0.0460648 0.0061619 0.005141 -0.168225 -0.0813815 -0.0029961 -0.1022914 0.0324915 0.0246457 -0.0038589 0.0127346 -0.0118731 0.0554952 0.046845 0.0489148 0.0760246 -0.1918506 0.0046595 -0.032465 0.0466683 -0.0228856 0.0747201 0.0281307 0.0237152 0.0707031 -0.1161022 -0.0070407 0.0064791 0.0326613 -0.0215953 -0.0786789 -0.006691 -0.0146383 -0.109078 0.0666793 -0.2023314 -0.0851156 -0.0058118 -0.1125644 0.0347643 0.0143897 0.0060405 0.0194378 0.0916055 0.0858528 0.0020488 -0.0150337 0.0627478 -0.1392656 -0.0848337 0.0054098 -0.1128698 0.0291132 0.076477 0.0000989 0.0729505 0.0232605 0.0729572 0.0397999 0.0095847 0.0539934 -0.1706138 0.0215903 0.0107627 0.0339045 0.0625383 -0.0495323 -0.0104976 0.054886 0.0226162 0.0679753 0.0858869 -0.0088485 -0.0278088 0.0183051 0.0058354 0.0743799 -0.0728578 0.0173948 -0.0109805 unknown
polarizability: 125.2998683|8.9238219|122.29745|-3.2747929|-11.9617583|90.4832859 unknown
InChI: InChI=1S/C8H15IO2/c1-2-3-4-5-6-11-8(10)7-9/h2-7H2,1H3
charge 0 multiplicity 1
26 atoms
I  3.289377 2.885237 -0.905019
O  1.707165 0.096585 0.911753
O  2.104846 -0.740297 -1.236925
C  -2.090639 -0.505015 0.450875
C  -3.238099 0.314215 -0.18247
C  -0.718366 0.197913 0.323214
C  -4.61553 -0.376686 -0.06226
C  0.400023 -0.634612 0.962086
C  -5.756102 0.444183 -0.701839
C  2.43544 -0.018986 -0.267593
C  3.690149 0.823734 -0.192737
H  -2.044412 -1.501746 -0.034933
H  -2.319259 -0.686581 1.522026
H  -3.28624 1.313299 0.298644
H  -3.011582 0.495017 -1.253646
H  -0.758192 1.190354 0.812095
H  -0.485082 0.364382 -0.745396
H  -4.564637 -1.376163 -0.54061
H  -4.841953 -0.55547 1.008869
H  0.233985 -0.789278 2.040759
H  0.521243 -1.605679 0.448413
H  -6.729916 -0.069555 -0.602508
H  -5.847284 1.437261 -0.222561
H  -5.569358 0.608876 -1.779842
H  4.459625 0.434485 -0.871154
H  4.049699 0.941527 0.83756
