program: Gaussian 09
title: 000228707
version: EM64L-G09RevD.01
frameworkgroup: C1[X(C16H24O3)]
method: RPBEPBE
basis: SDD
operation: Freq
keyword: #pfreq=noraman
keyword: PBEPBE/SDD
title: #p freq=noraman PBEPBE/SDD
converged: YES YES NO NO
title: Mulliken charges:
elementType: O O O C C C C C C C C C C C C C C C C H H H H H H H H H H H H H H H H H H H H H H H H
charge: -0.278272 -0.278693 -0.251538 -0.200422 0.342630 -0.363760 -0.721869 0.197614 -0.378081 -0.696985 -0.291844 -0.014854 -0.360404 -0.271385 -0.247480 -0.704372 0.292943 -0.492177 -0.660275 0.249012 0.196719 0.194263 0.213048 0.204199 0.227018 0.231211 0.208373 0.229601 0.209554 0.255872 0.200043 0.222065 0.245058 0.223690 0.223241 0.216417 0.249945 0.220176 0.240439 0.246595 0.228676 0.214739 0.229269
chargesum: 0.00000
title: Mulliken charges with hydrogens summed into heavy atoms:
elementType: O O O C C C C C C C C C C C C C C C C
charge: -0.278272 -0.278693 -0.251538 0.048590 0.342630 0.027222 -0.077604 0.197614 -0.146869 -0.049457 0.130264 0.241018 -0.115346 -0.047695 -0.024239 -0.017834 0.292943 -0.005143 0.012410
polarizability: 2.09191611e+02 -5.64433599e+00 1.94855879e+02 1.30882236e+01 -1.09792227e+01 1.42412200e+02
1716.lowfreq: -11.6991 -6.4774 -0.0003 0.0003 0.0005 5.1236 10.5168 15.7927 25.2470
frequency: 7.3237 15.2569 24.8990 33.8837 47.5219 64.6426 76.0190 82.8635 119.2601 131.9727 147.5257 173.7598 184.0475 193.3036 204.4270 218.9788 223.6415 234.6936 245.6613 274.2961 288.6753 315.1376 356.8247 401.5783 428.1152 450.0047 463.4493 488.1303 519.4017 546.8551 563.2102 566.6283 595.1966 641.7948 713.3700 745.4845 754.8359 782.8890 791.8363 793.4317 805.0828 848.3903 853.0979 859.8914 915.4063 932.1469 941.4477 960.3327 972.8047 995.6097 998.4801 1016.6854 1025.7873 1041.7787 1066.6790 1079.2303 1080.7666 1086.4477 1088.4576 1103.2339 1119.2986 1129.2504 1156.5372 1158.5100 1175.0675 1188.8615 1223.5329 1230.9729 1243.9673 1247.4765 1285.8783 1301.9637 1304.7668 1326.0680 1332.8036 1338.0709 1347.5508 1381.2706 1383.4633 1387.1350 1391.4059 1396.2472 1398.8907 1438.2028 1444.7506 1456.1602 1463.1212 1466.4358 1471.2144 1472.5228 1475.5705 1477.3756 1478.0623 1480.9689 1483.5187 1487.2285 1593.9001 1604.6450 1646.4350 2957.7361 2965.1338 2973.3387 2974.6527 2992.0181 2995.7450 2999.5424 3010.8034 3020.8295 3030.4760 3042.3219 3048.4193 3066.1201 3069.4576 3075.1767 3078.4654 3088.8296 3096.4557 3101.8987 3104.1622 3121.6979 3133.1028 3152.1380 3166.4621
redmass: 6.2430 3.9214 3.1352 4.2080 2.4463 2.6364 2.8813 3.6078 2.2228 3.1509 3.4682 2.6321 2.1493 1.1967 1.3354 1.1342 2.3204 1.7086 2.1221 3.6896 3.1195 3.4941 3.1588 3.5449 3.4636 3.2664 3.1544 3.0874 4.0540 2.8090 2.9859 3.4565 6.8161 3.9032 3.0087 2.5720 1.4533 3.4967 2.1556 1.4848 1.7691 1.6458 1.8571 3.8227 1.7437 1.4141 1.5078 1.2436 1.3078 1.7997 4.3485 1.8080 2.6791 2.1791 2.1910 2.6992 1.7906 1.6284 2.4034 2.5791 2.4855 2.8574 1.9090 1.7535 1.0690 1.9041 2.6442 1.2840 1.1786 1.2982 1.4917 1.3189 1.3068 1.3206 1.5490 1.5687 1.6570 1.5207 1.2114 1.2982 1.3082 2.5477 1.2147 2.2132 1.0849 1.1371 1.0737 1.0891 1.0466 1.0470 1.0849 1.0765 1.0616 1.0549 1.0621 1.8878 6.8599 6.1830 9.3830 1.0560 1.0578 1.0353 1.0372 1.0363 1.0563 1.0407 1.0949 1.1039 1.0909 1.0987 1.0879 1.0994 1.0987 1.1000 1.0997 1.0989 1.1003 1.1003 1.1000 1.0855 1.0890 1.0935 1.0993
irintensity: 0.4732 0.0591 0.0982 0.5550 0.3435 0.6991 3.7248 0.4945 1.1722 3.1143 2.7765 1.5576 1.0228 1.3876 0.5108 0.4121 0.9234 0.2016 0.2250 3.7482 6.5189 1.2646 1.0418 1.9991 8.6785 5.8881 4.7241 5.9176 1.0212 2.5304 0.9129 1.5948 5.0400 1.5805 10.9870 5.7124 79.2346 14.4507 1.3777 22.9583 9.7518 0.3838 1.4842 23.1104 3.6912 1.9625 3.2506 4.7776 0.3161 28.7855 53.3166 29.0428 1.9797 17.5587 88.6388 80.6665 22.1069 1.5493 30.8940 13.4412 24.4727 272.9703 21.5142 3.2691 4.1729 31.0878 145.9161 8.5062 1.9887 11.0520 3.4897 0.6023 5.4847 24.6835 5.0266 8.2635 23.0088 4.6297 5.4066 13.5606 8.8089 27.5116 20.2740 32.8197 27.6739 18.6576 4.5169 32.4507 9.2099 7.5651 9.1111 11.3605 8.7795 8.8815 18.7387 51.0737 6.4090 29.8225 155.9459 48.7288 32.6594 67.6617 10.9737 23.3367 25.7704 14.6000 12.1127 19.6226 7.4549 5.4267 11.1632 13.5310 78.1115 63.9958 41.1421 34.0913 28.3074 33.3278 17.4343 5.7295 12.9441 37.0757 18.1479
temp: 298.150 k
press: 1.00000 atm
elementType: 8 8 8 6 6 6 6 6 6 6 6 6 6 6 6 6 6 6 6 1 1 1 1 1 1 1 1 1 1 1 1 1 1 1 1 1 1 1 1 1 1 1 1
symmnumber: 1
zpe: 958428.1 jmol-1
zpe.correction: 0.365046 hartree
zpe.thermalcorrener: 0.386859 hartree
zpe.thermalcorrenthalpy: 0.387804 hartree
zpe.thermalcorrgfe: 0.310048 hartree
zpe.sumelectzpe: -848.302480 hartree
zpe.sumelectthermal: -848.280666 hartree
zpe.sumelectthermalent: -848.279722 hartree
zpe.sumelectthermalfe: -848.357478 hartree
dipole: -0.0427 1.7397 -1.6476
dipole: 2.3965
quadrupole: -114.8724 -102.6061 -119.7523
quadrupole: 3.3391 -5.4548 1.2687
quadrupole: -2.4621 9.8042 -7.3420 3.3391 -5.4548 1.2687
hfenergy: -848.6675258 hartree
pointgroup: C01 [X(C16H24O3)]
dipole: 0.1298167 0.933748 -0.0142694 debye
polarizability: 204.4178035|-16.727528|186.4823593|9.9808121|23.8605999|155.5595266 unknown
InChI: InChI=1S/C16H24O3/c1-5-12(3)14-9-7-8-10-15(14)18-11-13(4)19-16(17)6-2/h7-10,12-13H,5-6,11H2,1-4H3
charge 0 multiplicity 1
43 atoms
O  -0.283905 0.336159 1.117454
O  2.546236 0.448041 0.449726
O  3.38239 -1.6859 0.903967
C  -1.945422 -1.551761 -0.196895
C  -2.418163 -0.129356 0.118058
C  -1.823492 -1.790046 -1.732043
C  -2.873527 -2.612948 0.450994
C  -1.568998 0.807948 0.776832
C  -3.714519 0.308305 -0.24203
C  -0.780322 -0.883662 -2.419524
C  0.666283 1.281227 1.708946
C  1.99922 0.550387 1.841397
C  -2.008899 2.123439 1.06666
C  -4.169252 1.617827 0.035969
C  -3.311324 2.524354 0.693966
C  3.011736 1.299704 2.717115
C  3.198684 -0.742628 0.102026
C  3.62751 -0.692104 -1.356247
C  4.294465 -1.995227 -1.829198
H  -0.93606 -1.673538 0.236422
H  -1.554336 -2.853583 -1.893698
H  -2.815724 -1.641877 -2.205599
H  -2.477626 -3.630235 0.272474
H  -3.895508 -2.57193 0.028921
H  -2.952723 -2.460374 1.542323
H  -4.383823 -0.394373 -0.752924
H  -0.705392 -1.108838 -3.49952
H  -1.046952 0.183174 -2.310183
H  0.219976 -1.025227 -1.967791
H  1.838029 -0.476149 2.217026
H  0.314184 1.604181 2.711027
H  0.784324 2.172192 1.059957
H  -1.355225 2.836463 1.577779
H  -5.179158 1.924362 -0.256522
H  -3.648246 3.542261 0.919894
H  2.641041 1.379666 3.755419
H  3.968328 0.751788 2.739212
H  3.19875 2.317081 2.32963
H  4.307275 0.173352 -1.478545
H  2.731998 -0.453533 -1.961699
H  5.19206 -2.222699 -1.229108
H  4.5930 -1.91002 -2.888954
H  3.606109 -2.851599 -1.727916
