program: Gaussian 09
title: 000228710
version: EM64L-G09RevD.01
frameworkgroup: C1[X(C17H26O3)]
method: RPBEPBE
basis: SDD
operation: Freq
keyword: #pfreq=noraman
keyword: PBEPBE/SDD
title: #p freq=noraman PBEPBE/SDD
converged: YES YES NO NO
title: Mulliken charges:
elementType: O O O C C C C C C C C C C C C C C C C C H H H H H H H H H H H H H H H H H H H H H H H H H H
charge: -0.293477 -0.294489 -0.243566 -0.188084 0.359709 -0.374503 -0.716295 0.160616 -0.380681 0.041135 -0.694845 -0.377606 -0.345409 -0.273479 -0.251664 -0.689252 -0.488428 0.269055 -0.349032 -0.681516 0.237976 0.189782 0.196861 0.227338 0.209268 0.210122 0.233390 0.229465 0.229150 0.228670 0.231079 0.206147 0.209551 0.265659 0.222620 0.221143 0.249513 0.215305 0.245917 0.235087 0.237522 0.208637 0.228913 0.223717 0.209706 0.209275
chargesum: 0.00000
title: Mulliken charges with hydrogens summed into heavy atoms:
elementType: O O O C C C C C C C C C C C C C C C C C
charge: -0.293477 -0.294489 -0.243566 0.049892 0.359709 0.012140 -0.069566 0.160616 -0.151217 0.274525 -0.048068 0.080215 -0.079750 -0.050860 -0.030522 0.021483 -0.015819 0.269055 0.088517 -0.038818
polarizability: 2.34185249e+02 -4.09327675e+00 2.05718356e+02 1.21856324e+01 1.38656881e-01 1.42023878e+02
1716.lowfreq: -30.0349 -11.8591 -7.2273 -3.0499 -0.0009 -0.0006 -0.0005 8.1796 27.8647
frequency: -29.3356 6.1357 27.6051 30.4147 41.4234 53.8204 69.7646 76.1855 100.3291 105.8572 117.7472 135.8838 167.7780 197.4321 206.8477 209.7678 215.5918 223.8238 232.0185 247.3561 257.6475 302.5923 311.0913 343.8874 379.5272 400.3362 424.2216 436.5105 461.2296 480.1404 552.9793 557.5849 562.4360 577.3832 607.7362 692.0205 701.6307 738.0654 744.3963 754.7015 759.1080 791.4215 799.2499 852.2016 859.2041 863.6333 869.5354 893.1968 920.5514 936.2749 940.1994 956.8421 963.5247 972.6639 993.2819 1024.9442 1039.6284 1054.7873 1063.9590 1077.8153 1081.6479 1087.6730 1097.1123 1100.4520 1108.2398 1137.8615 1156.2821 1159.2218 1173.6237 1184.0762 1219.3767 1221.8890 1243.5346 1265.1087 1279.1695 1281.5833 1296.9201 1298.6248 1318.0229 1329.7778 1330.1174 1332.3840 1359.2293 1364.3667 1380.9819 1386.7532 1391.0167 1391.5414 1393.3074 1436.4606 1441.2574 1454.0651 1464.4104 1468.3832 1471.9932 1472.8186 1474.4238 1474.6054 1475.5655 1478.2889 1484.4767 1485.1623 1486.1534 1590.0570 1605.1203 1640.0303 2966.3455 2970.8115 2974.1467 2975.9182 2979.9073 2993.4919 3000.3437 3000.4571 3009.0041 3011.1399 3027.9786 3038.6196 3055.1912 3062.7458 3065.0975 3069.6139 3076.6816 3077.0807 3077.7042 3079.2305 3094.9182 3117.5171 3119.7899 3130.1395 3153.9007 3170.7496
redmass: 3.1838 3.8463 4.3336 4.0636 2.3552 2.8841 3.7431 2.8276 3.7380 3.5813 2.2794 3.6860 2.5816 1.8578 1.1991 1.6404 1.3782 1.1123 2.8988 2.7959 2.2128 3.3326 3.6959 2.9140 3.3249 2.5785 3.1685 3.1380 4.6686 3.1583 3.1881 3.2056 3.4689 4.2241 3.9777 4.3023 3.6686 1.3407 2.6451 3.6220 1.2687 2.3887 1.5757 2.0851 1.5729 2.5446 1.4077 2.3832 1.8226 1.3993 3.1346 1.2918 2.4647 1.3092 1.6250 2.5250 2.2341 2.4035 2.0308 1.7777 2.1211 2.1637 2.6139 1.8034 2.2368 2.4676 2.1269 1.9435 1.1577 1.7226 2.2722 1.3560 1.2948 1.2568 1.2391 1.4855 1.2492 1.2842 1.7155 1.4007 1.4165 1.5260 1.6630 1.2660 1.2740 1.3404 2.5565 1.2468 1.2141 2.1572 1.0887 1.0952 1.0703 1.0535 1.0855 1.0496 1.1573 1.0535 1.0540 1.0424 1.5225 1.2099 1.0943 6.7605 6.2547 9.9246 1.0536 1.0397 1.0364 1.0373 1.0644 1.0622 1.0383 1.0614 1.0930 1.0784 1.0916 1.0958 1.0986 1.1062 1.0995 1.0992 1.0995 1.0992 1.0998 1.1013 1.0975 1.0861 1.1018 1.0895 1.0960 1.0963
irintensity: 0.0091 0.1109 0.0600 0.5031 0.0995 2.2582 1.5928 0.0366 0.6125 1.6068 0.0819 2.1866 0.8434 0.5975 2.1791 3.4649 4.2517 0.1337 4.9444 1.0107 1.5284 5.6280 0.2982 3.2643 4.8129 3.2738 0.7570 4.8131 6.4167 6.9992 1.0713 7.5444 0.2408 3.5930 4.7492 4.8928 5.1352 11.0092 0.9452 2.3659 93.0186 7.5107 10.4199 0.7958 1.3907 4.0241 0.2308 1.6007 23.1253 9.3025 102.5707 1.7057 80.6588 0.2627 20.5994 1.2545 17.2748 23.7133 13.0396 43.1253 178.0328 27.5939 4.0818 30.9075 14.5409 182.6690 9.0828 31.6841 20.0917 44.5772 80.3248 4.4562 5.8771 36.2000 30.4543 5.9254 32.6627 7.2345 5.6095 3.3935 0.6540 5.6764 31.2666 9.8581 6.1078 10.7691 16.0720 32.4084 8.9820 25.0584 22.4559 8.5810 3.6765 22.5380 0.4806 10.0092 25.0055 6.6617 7.1098 13.1433 45.5142 18.1303 23.1316 8.6285 23.1076 188.8061 15.1752 76.3521 34.1511 22.9202 5.5157 16.9209 12.2949 25.0579 11.2034 44.6059 12.2445 2.5712 1.2315 13.7183 33.4466 57.1428 34.4947 50.9094 75.8536 74.5682 24.3225 6.6663 14.7953 20.2055 26.3416 7.6311
temp: 298.150 k
press: 1.00000 atm
elementType: 8 8 8 6 6 6 6 6 6 6 6 6 6 6 6 6 6 6 6 6 1 1 1 1 1 1 1 1 1 1 1 1 1 1 1 1 1 1 1 1 1 1 1 1 1 1
symmnumber: 1
zpe: 1031513.6 jmol-1
zpe.correction: 0.392883 hartree
zpe.thermalcorrener: 0.415112 hartree
zpe.thermalcorrenthalpy: 0.416056 hartree
zpe.thermalcorrgfe: 0.338201 hartree
zpe.sumelectzpe: -887.522764 hartree
zpe.sumelectthermal: -887.500535 hartree
zpe.sumelectthermalent: -887.499591 hartree
zpe.sumelectthermalfe: -887.577447 hartree
dipole: -0.0418 0.6157 -0.4319
dipole: 0.7533
quadrupole: -123.5537 -118.1141 -121.7397
quadrupole: -9.6537 0.3846 1.1200
quadrupole: -2.4179 3.0217 -0.6038 -9.6537 0.3846 1.1200
hfenergy: -887.9156471 hartree
pointgroup: C01 [X(C17H26O3)]
dipole: -0.1188701 0.1093511 -0.2484698 debye
polarizability: 214.0569919|31.5925239|154.5889136|-15.1779936|-0.0494316|213.2815774 unknown
InChI: InChI=1S/C17H26O3/c1-5-9-17(18)20-14(4)12-19-16-11-8-7-10-15(16)13(3)6-2/h7-8,10-11,13-14H,5-6,9,12H2,1-4H3
charge 0 multiplicity 1
46 atoms
O  -0.269832 0.006318 1.463148
O  2.378403 0.501974 -0.159494
O  4.572614 1.259663 0.092774
C  -2.544743 -1.564679 2.096917
C  -2.176932 -1.214446 0.652369
C  -4.023417 -1.224415 2.44154
C  -2.243385 -3.062117 2.381427
C  -1.02642 -0.429426 0.347496
C  -2.947644 -1.687503 -0.43744
C  2.084503 0.878224 1.267268
C  -4.358752 0.276788 2.3121
C  0.586052 1.195801 1.356737
C  -0.663972 -0.136312 -0.989135
C  -2.611887 -1.391233 -1.777524
C  -1.464935 -0.613346 -2.04974
C  2.544035 -0.247818 2.200382
C  3.859656 0.194712 -2.027095
C  3.689761 0.718322 -0.611484
C  5.020439 0.87179 -2.787766
C  5.247197 0.236478 -4.175006
H  -1.898922 -0.958802 2.75871
H  -4.704051 -1.815591 1.795586
H  -4.217684 -1.559826 3.480335
H  -1.184287 -3.300163 2.175597
H  -2.453965 -3.308466 3.439279
H  -2.866915 -3.720252 1.74696
H  2.652702 1.806783 1.477218
H  -3.83675 -2.294999 -0.228825
H  0.416408 1.744642 2.301955
H  0.272378 1.836698 0.51154
H  -4.197244 0.629448 1.277385
H  -3.717003 0.883333 2.978919
H  -5.412397 0.47729 2.580704
H  0.257572 0.413714 -1.198491
H  -3.233242 -1.768078 -2.597115
H  -1.181295 -0.388049 -3.084137
H  2.011298 -1.182773 1.96368
H  2.320855 0.016432 3.250169
H  3.631443 -0.402122 2.106078
H  2.901448 0.299744 -2.567718
H  4.048341 -0.896465 -1.952254
H  4.804991 1.951984 -2.898025
H  5.939013 0.801464 -2.177088
H  6.074703 0.737088 -4.70927
H  5.504363 -0.836054 -4.086107
H  4.342599 0.313741 -4.80736
