program: Gaussian 09
title: 000228703
version: EM64L-G09RevD.01
frameworkgroup: C1[X(C14H20O3)]
method: RPBEPBE
basis: SDD
operation: Freq
keyword: #pfreq=noraman
keyword: PBEPBE/SDD
title: #p freq=noraman PBEPBE/SDD
converged: YES YES NO NO
title: Mulliken charges:
elementType: O O O C C C C C C C C C C C C C C H H H H H H H H H H H H H H H H H H H H
charge: -0.254203 -0.236705 -0.237065 -0.213516 -0.367641 0.544220 -0.715631 -0.434473 -0.415501 -0.691950 0.353700 -0.384615 -0.369647 -0.004449 -0.361502 -0.693555 0.018502 0.199802 0.194610 0.196712 0.227019 0.209028 0.211193 0.234209 0.226781 0.212624 0.234006 0.203828 0.250256 0.226114 0.280026 0.255784 0.196485 0.254705 0.216021 0.226079 0.208749
chargesum: 0.00000
title: Mulliken charges with hydrogens summed into heavy atoms:
elementType: O O O C C C C C C C C C C C C C C
charge: -0.254203 -0.236705 -0.237065 -0.013714 0.023682 0.544220 -0.068390 -0.200264 -0.188720 -0.041492 0.353700 -0.134359 -0.143533 0.275577 0.090767 0.003250 0.227251
polarizability: 2.04899096e+02 -1.18494493e+01 1.32433409e+02 -3.53031669e+00 3.19547136e-01 1.46104706e+02
1716.lowfreq: -9.6293 -4.9176 0.0001 0.0005 0.0006 2.2773 19.0619 21.5424 39.2869
frequency: 18.9919 20.9882 39.2669 40.3059 55.4802 68.8466 107.9458 141.0620 172.4301 188.0234 198.3654 206.2639 208.4902 236.3737 245.2525 272.4755 292.0891 326.4653 365.6010 404.3375 411.9869 423.7414 447.5974 470.1342 516.6498 544.2985 561.0331 633.1294 666.4758 718.7538 733.1787 756.4594 777.1209 799.7753 808.7083 836.3759 851.7991 895.4622 932.9116 933.7551 956.5740 960.3975 961.7780 993.0832 998.4413 1007.1736 1028.8052 1063.9525 1072.7091 1094.9065 1099.6661 1111.3690 1118.6235 1144.0706 1151.6939 1177.2515 1205.3144 1216.4678 1247.1351 1259.1974 1282.6199 1300.3007 1304.9098 1326.9972 1331.4622 1333.8144 1343.1110 1373.5809 1385.0377 1386.9443 1390.4023 1391.3170 1416.9695 1458.6653 1462.6835 1467.4024 1472.3938 1475.9336 1476.0870 1479.0059 1484.0919 1496.6409 1583.5675 1618.4841 1622.1100 2964.1496 2971.4870 2974.0098 2976.4029 2990.3634 2994.6487 3019.7742 3040.9071 3042.4122 3066.4921 3069.4892 3078.0924 3080.1418 3085.7029 3093.9572 3106.0713 3118.5904 3122.4229 3151.9116 3164.1549
redmass: 6.1288 3.4394 5.2052 3.8455 3.9659 3.4247 2.5125 2.7104 3.6035 3.9530 2.1079 1.0736 1.1595 1.5170 3.4088 2.5355 3.5296 2.4522 3.7946 3.4347 2.9251 2.7144 3.4098 3.4303 3.1515 2.5052 3.7687 6.3867 2.9402 4.6865 3.3431 4.1560 2.7377 1.5226 1.3789 1.5415 2.0366 1.8608 1.3952 1.5564 1.2507 1.6025 1.3691 1.8379 5.0024 2.4201 2.6250 1.9876 1.7782 8.0124 2.5352 1.6468 2.0547 1.9393 1.8791 1.4574 1.7654 2.3464 1.2907 1.1951 1.3044 1.3507 1.3667 1.2189 1.5036 1.7198 1.1264 1.3582 1.6244 1.6927 1.3638 1.2121 2.8905 1.0763 1.0685 1.0620 1.0525 1.0640 1.0616 1.0462 1.0612 2.4177 6.9207 7.2993 7.5267 1.0708 1.0658 1.0391 1.0386 1.0500 1.0510 1.1008 1.0918 1.0863 1.0995 1.0992 1.0998 1.0999 1.0988 1.0981 1.1003 1.0881 1.0892 1.0940 1.0951
irintensity: 0.5951 0.2006 1.2011 0.4871 0.0922 0.4168 0.3727 1.4115 2.2319 4.1809 1.7239 0.6285 0.4503 1.6492 0.9636 5.5313 2.9039 7.9959 2.3867 2.9191 1.2501 10.9376 4.1578 17.3068 3.5146 26.0822 3.3576 0.1054 14.9183 2.1758 2.9914 10.6311 2.8408 14.0169 16.4543 44.6790 2.5671 10.1661 0.2119 0.5941 6.7848 2.3096 0.6732 36.6590 29.5078 38.9522 5.1150 38.1673 29.8916 292.7279 6.1383 6.4033 8.8272 12.7612 7.2382 106.4185 86.0999 20.7425 0.9946 45.6139 0.1466 6.0331 1.2363 11.6767 1.1584 18.9929 3.1072 8.7401 14.6252 5.2025 17.1524 25.4760 0.6011 6.8227 2.3754 17.6614 11.6584 3.0071 10.2947 8.8935 7.8661 145.4197 4.6594 115.5771 160.3572 9.9979 22.4078 77.3962 17.3444 5.1752 59.2903 32.5640 61.4678 5.4421 27.2116 70.5194 26.9944 74.7744 6.5779 41.3688 13.8144 15.2903 22.3987 21.1977 5.3144
temp: 298.150 k
press: 1.00000 atm
elementType: 8 8 8 6 6 6 6 6 6 6 6 6 6 6 6 6 6 1 1 1 1 1 1 1 1 1 1 1 1 1 1 1 1 1 1 1 1
symmnumber: 1
zpe: 813297.5 jmol-1
zpe.correction: 0.309769 hartree
zpe.thermalcorrener: 0.328380 hartree
zpe.thermalcorrenthalpy: 0.329324 hartree
zpe.thermalcorrgfe: 0.260286 hartree
zpe.sumelectzpe: -769.839228 hartree
zpe.sumelectthermal: -769.820617 hartree
zpe.sumelectthermalent: -769.819673 hartree
zpe.sumelectthermalfe: -769.888710 hartree
dipole: 0.0039 -1.6477 1.6488
dipole: 2.3310
quadrupole: -91.4545 -112.9619 -96.1646
quadrupole: -7.3264 3.6404 -3.8589
quadrupole: 8.7392 -12.7682 4.0290 -7.3264 3.6404 -3.8589
hfenergy: -770.1489966 hartree
pointgroup: C01 [X(C14H20O3)]
dipole: 0.0369872 -0.0395279 0.9154797 debye
polarizability: 205.3608518|-6.957046|139.1369086|-8.5721378|-6.880703|138.9394516 unknown
InChI: InChI=1S/C14H20O3/c1-4-11(2)13-5-7-14(8-6-13)16-9-12(3)17-10-15/h5-8,10-12H,4,9H2,1-3H3
charge 0 multiplicity 1
37 atoms
O  -1.48062 1.82007 0.506233
O  -3.889989 0.259653 -0.400865
O  -3.462819 -1.557473 -1.823571
C  4.11233 0.482201 -0.215103
C  4.34577 -0.925694 -0.838739
C  2.627253 0.795523 -0.013878
C  4.902796 0.628483 1.113144
C  2.02127 1.910857 -0.65007
C  1.808684 -0.005147 0.820213
C  3.737389 -1.091642 -2.247289
C  -0.137782 1.405116 0.375268
C  0.659759 2.219083 -0.463301
C  0.439213 0.282347 1.019743
C  -2.892744 -0.244372 0.609107
C  -2.386085 1.013243 1.32872
C  -3.595082 -1.229751 1.553327
C  -4.050503 -0.49056 -1.554648
H  4.515962 1.228094 -0.931517
H  3.929039 -1.697077 -0.159302
H  5.43852 -1.108727 -0.882562
H  4.769033 1.634541 1.549706
H  4.559764 -0.110822 1.861339
H  5.983705 0.462666 0.946135
H  2.627753 2.549835 -1.303641
H  2.238569 -0.876898 1.328709
H  3.939039 -2.100228 -2.652437
H  2.642547 -0.944693 -2.229183
H  4.164165 -0.353081 -2.952477
H  0.195408 3.080647 -0.952851
H  -0.149741 -0.368872 1.673369
H  -2.083298 -0.746796 0.049704
H  -3.237693 1.681472 1.536831
H  -1.907527 0.735363 2.288785
H  -4.001476 -2.081689 0.983635
H  -2.878914 -1.628347 2.295238
H  -4.422441 -0.738247 2.095227
H  -4.790752 0.020019 -2.199001
