program: Gaussian 09
title: 000228702
version: EM64L-G09RevD.01
frameworkgroup: C1[X(C13H17ClO3)]
method: RPBEPBE
basis: SDD
operation: Freq
keyword: #p
keyword: freq=noraman
keyword: PBEPBE/SDD
title: #p freq=noraman PBEPBE/SDD
converged: YES YES NO NO
title: Mulliken charges:
elementType: Cl O O O C C C C C C C C C C C C C H H H H H H H H H H H H H H H H H
charge: -0.037964 -0.259172 -0.253682 -0.253738 -0.035328 -0.302902 -0.490087 -0.705110 -0.349376 0.254415 0.509335 -0.681829 -0.322149 -0.332539 -0.208308 -0.232984 -0.243451 0.231245 0.214496 0.264513 0.233384 0.246468 0.228104 0.205179 0.267674 0.209388 0.226433 0.222954 0.207980 0.211948 0.256732 0.254657 0.229600 0.234115
chargesum: 0.00000
title: Mulliken charges with hydrogens summed into heavy atoms:
elementType: Cl O O O C C C C C C C C C C C C C
charge: -0.037964 -0.259172 -0.253682 -0.253738 0.195917 0.176107 -0.010236 -0.004153 0.086446 0.254415 0.509335 -0.038947 -0.322149 -0.075807 0.046348 -0.003384 -0.009336
polarizability: 1.78463356e+02 1.89665854e+01 1.39927780e+02 -1.06613401e+00 1.67382615e+01 1.56079350e+02
1716.lowfreq: -13.3368 -7.7310 -1.6979 -0.0004 0.0006 0.0016 8.4482 21.1820 24.7377
frequency: -11.3381 20.9670 24.5772 50.5440 69.7404 80.1598 92.3027 119.6396 149.0599 165.5931 200.9687 211.9615 218.7082 229.9374 249.2526 260.9138 278.3740 343.4748 376.4105 402.9354 431.0856 441.3788 463.9762 536.0192 540.1886 569.7627 627.6937 680.3856 693.4448 709.7517 739.4658 751.5610 779.6513 805.9517 839.6434 868.0474 870.5221 902.8618 924.7368 940.4367 941.4131 968.6006 969.9342 1021.5373 1042.2185 1054.6382 1063.2677 1086.8127 1103.5566 1110.5991 1131.4697 1145.9046 1163.6105 1172.4604 1222.2791 1226.4122 1237.8165 1266.9998 1278.2713 1297.4848 1322.9857 1343.2962 1360.8835 1367.5482 1382.3836 1393.7926 1396.5290 1427.9087 1442.8310 1459.4954 1464.8672 1474.1802 1476.5988 1478.9428 1482.6128 1485.8039 1574.5572 1604.4927 1630.7896 2964.5414 2974.7676 2979.1510 3000.4062 3002.0573 3019.8887 3040.9170 3043.6393 3058.8322 3076.9895 3080.3716 3096.6443 3124.2112 3138.9812 3154.4837 3165.9086 3177.7759
redmass: 2.3120 5.6098 3.7507 4.0830 5.1290 4.6125 3.5066 3.6847 5.1721 2.7222 4.7806 4.0853 1.3113 1.1084 3.5064 5.1830 3.0718 3.3238 7.8186 4.0108 2.9430 3.2067 5.0935 4.3270 3.8455 3.5515 4.8377 5.9338 4.5994 3.5240 1.2097 1.2840 4.2088 4.1385 1.4146 1.3280 3.1294 2.3816 1.3813 2.0524 2.4452 2.2232 1.4089 7.3206 2.0211 2.4039 1.8778 2.0775 1.6917 2.2170 1.5712 2.4697 2.0835 1.0710 1.3356 1.1468 2.6371 1.5543 1.2052 1.2939 1.6500 1.4212 1.6820 1.5765 3.4180 1.2155 1.2716 2.3189 1.0871 1.1828 1.3943 1.0519 1.2263 1.0431 1.1992 1.0790 6.3271 7.1401 9.7361 1.0598 1.0363 1.0651 1.0616 1.0377 1.0839 1.0963 1.1027 1.0975 1.0994 1.1010 1.0983 1.1009 1.0857 1.0898 1.0942 1.1004
irintensity: 0.0016 0.6440 0.2890 2.7137 0.9286 0.4614 1.0414 2.1944 1.3371 5.4548 1.2817 5.7758 0.6287 0.1420 7.4307 0.4646 0.2724 5.4334 3.7901 4.9815 0.4529 6.2171 2.4052 4.0491 0.2817 2.3158 2.6369 26.1817 1.6918 0.7963 15.6824 102.3739 15.8647 7.2949 0.6009 0.2001 0.7572 2.1217 0.2045 28.9836 86.1040 53.0191 9.5577 54.9505 29.7705 17.4323 37.9380 123.2814 42.6026 7.5048 6.9683 235.9862 4.5276 3.9156 9.2113 46.7541 137.0749 53.4744 21.6862 44.5960 1.2990 13.4529 28.9171 2.1357 17.6900 8.0631 26.8630 19.1583 24.7986 71.2581 79.2005 3.9217 29.9819 13.1967 2.7588 16.6539 10.3418 45.1201 146.5761 26.3551 35.7820 5.3436 24.0970 16.8981 21.2042 0.5921 21.8541 1.4370 46.7880 73.2927 29.8944 14.1239 2.7439 11.4392 14.2596 10.6246
temp: 298.150 k
press: 1.00000 atm
elementType: 17 8 8 8 6 6 6 6 6 6 6 6 6 6 6 6 6 1 1 1 1 1 1 1 1 1 1 1 1 1 1 1 1 1
symmnumber: 1
zpe: 716787.1 jmol-1
zpe.correction: 0.273010 hartree
zpe.thermalcorrener: 0.290469 hartree
zpe.thermalcorrenthalpy: 0.291414 hartree
zpe.thermalcorrgfe: 0.225354 hartree
zpe.sumelectzpe: -1190.014146 hartree
zpe.sumelectthermal: -1189.996686 hartree
zpe.sumelectthermalent: -1189.995742 hartree
zpe.sumelectthermalfe: -1190.061801 hartree
dipole: 0.0409 -0.2085 -1.3810
dipole: 1.3973
quadrupole: -100.6284 -102.5451 -108.9423
quadrupole: 6.3689 9.9691 -2.7448
quadrupole: 3.4102 1.4935 -4.9037 6.3689 9.9691 -2.7448
hfenergy: -1190.2871553 hartree
pointgroup: C01 [X(C13H17Cl1O3)]
dipole: 0.0414802 -0.0905057 0.5406366 debye
polarizability: 180.4154565|16.9800453|130.0531373|-7.5290695|3.2861533|164.0018912 unknown
InChI: InChI=1S/C13H17ClO3/c1-3-6-13(15)17-10(2)9-16-12-8-5-4-7-11(12)14/h4-5,7-8,10H,3,6,9H2,1-2H3
charge 0 multiplicity 1
34 atoms
Cl -2.367517 -1.557946 -2.692458
O  1.969317 0.114044 -0.528774
O  -0.622485 -1.388887 -0.307689
O  2.394396 1.003193 1.5867
C  1.772613 -1.242075 0.085956
C  0.393792 -1.327858 0.751617
C  2.536309 2.444332 -0.425654
C  1.989102 -2.249668 -1.042683
C  2.322496 3.711453 0.4304
C  2.299769 1.157837 0.344757
C  -1.960266 -1.45515 0.077094
C  2.675027 4.995501 -0.348716
C  -2.925402 -1.536178 -0.962358
C  -2.415963 -1.447325 1.420871
C  -4.30004 -1.602708 -0.683224
C  -3.798407 -1.51439 1.70538
C  -4.744108 -1.591241 0.660921
H  2.524794 -1.350045 0.89166
H  0.346747 -2.248985 1.36978
H  0.227652 -0.448746 1.401925
H  3.581031 2.419347 -0.799933
H  1.890689 2.443279 -1.32223
H  3.000794 -2.135751 -1.466125
H  1.883396 -3.279896 -0.656898
H  1.242339 -2.0989 -1.837806
H  1.26826 3.752533 0.765498
H  2.935974 3.635892 1.346763
H  2.510365 5.894119 0.272758
H  3.736026 4.993308 -0.663119
H  2.054517 5.096764 -1.258918
H  -1.69886 -1.385998 2.244394
H  -5.013715 -1.663363 -1.510329
H  -4.131064 -1.505139 2.748774
H  -5.815182 -1.642558 0.879166
