program: Gaussian 09
title: 000228699
version: EM64L-G09RevD.01
frameworkgroup: C1[X(C16H24O3)]
method: RPBEPBE
basis: SDD
operation: Freq
keyword: #pfreq=noraman
keyword: PBEPBE/SDD
title: #p freq=noraman PBEPBE/SDD
converged: YES YES NO NO
title: Mulliken charges:
elementType: O O O C C C C C C C C C C C C C C C C H H H H H H H H H H H H H H H H H H H H H H H H
charge: -0.263501 -0.277873 -0.252377 -0.213227 -0.366794 0.541892 -0.717426 -0.410214 -0.437046 -0.693578 0.349362 -0.009026 -0.364771 -0.386374 -0.300174 -0.708964 0.293494 -0.488650 -0.661590 0.199241 0.195595 0.196357 0.210585 0.227340 0.208826 0.225904 0.233379 0.211691 0.204079 0.233200 0.255966 0.222024 0.200396 0.242400 0.249072 0.256168 0.217250 0.218713 0.246811 0.238777 0.235276 0.214715 0.223074
chargesum: 0.00000
title: Mulliken charges with hydrogens summed into heavy atoms:
elementType: O O O C C C C C C C C C C C C C C C C
charge: -0.263501 -0.277873 -0.252377 -0.013985 0.025157 0.541892 -0.070674 -0.184311 -0.203667 -0.044608 0.349362 0.246940 -0.122371 -0.137302 0.122246 -0.016832 0.293494 -0.003062 0.011474
polarizability: 2.46123180e+02 -4.86518573e+00 1.64044239e+02 6.60411746e+00 1.31211872e+01 1.49090004e+02
1716.lowfreq: -5.3134 -4.6258 0.0004 0.0009 0.0011 6.0780 15.8141 23.4650 28.0270
frequency: 15.7175 23.0731 27.6143 33.7535 46.8877 56.2996 80.7639 83.5475 114.5092 138.9228 143.1219 174.8941 188.2749 191.5965 211.4942 212.8905 225.8181 238.0887 253.9136 264.5922 292.1341 347.6179 375.4368 410.0115 415.8701 436.2174 450.0542 473.0252 503.6201 540.9980 547.8015 559.3191 632.2524 646.2698 694.7952 735.0673 781.7740 791.3983 794.7792 806.8413 814.6412 837.1468 851.2088 860.9776 914.3067 933.9917 944.0951 956.4325 962.3084 992.2896 998.0687 1005.0991 1016.1174 1028.6070 1068.3342 1070.6594 1079.4185 1085.2238 1102.1324 1112.1301 1119.3974 1132.2688 1151.6422 1158.7738 1180.6133 1212.5201 1224.4340 1233.3063 1243.4303 1245.9467 1285.0281 1300.4023 1302.3971 1325.5449 1328.9691 1333.9640 1347.4325 1377.3014 1381.7484 1388.4393 1389.5814 1396.1854 1399.2811 1417.8474 1444.4493 1458.3987 1463.5075 1467.6000 1471.2108 1471.9048 1475.6876 1477.2581 1480.5045 1481.6488 1485.1294 1500.8665 1583.6051 1621.8102 1644.7900 2958.8785 2963.1888 2970.1146 2972.6811 2975.6543 2992.2479 2996.8612 2999.6624 3019.4186 3021.3809 3048.8602 3049.5079 3065.2443 3068.5846 3076.9304 3079.4336 3088.6943 3095.2227 3103.9157 3106.4103 3118.2827 3121.9163 3157.8534 3163.4256
redmass: 3.7267 2.3904 2.7594 7.0858 3.5433 3.7650 3.2374 3.8341 2.3901 3.2249 2.8883 2.1786 1.6013 2.0489 1.0945 1.6277 1.6003 1.7709 2.0916 3.2327 3.0530 3.8026 3.7923 3.1674 3.2650 3.5894 3.2256 2.9599 3.4871 3.0289 2.3514 3.0097 6.8416 3.8303 3.1089 3.3445 2.9029 1.4758 1.4632 3.1585 1.3862 1.5789 2.0580 3.8331 1.7597 1.4346 1.5140 1.2449 1.3652 1.9633 4.5613 2.2105 1.8242 2.6068 1.7435 1.8860 2.7677 1.7173 2.3926 1.6432 2.1927 2.9850 1.8903 1.7018 1.2644 1.8915 3.6486 1.1679 1.1773 1.3070 1.2983 1.3776 1.3331 1.3169 1.5535 1.6590 1.6668 1.9497 1.2185 1.3169 1.2905 1.7993 1.2129 2.9235 1.0850 1.1042 1.0669 1.0714 1.0396 1.0521 1.0428 1.0755 1.0460 1.0513 1.0611 2.3645 6.9575 6.4368 9.4065 1.0560 1.0739 1.0611 1.0406 1.0386 1.0364 1.0545 1.0438 1.1009 1.1041 1.0972 1.0880 1.0996 1.0992 1.0999 1.0998 1.0989 1.1004 1.1001 1.1000 1.0889 1.0890 1.0934 1.0951
irintensity: 0.0355 0.1919 0.1884 0.7285 0.4064 1.7792 1.9346 0.4646 0.8173 1.9565 1.8062 2.6330 0.7482 0.9927 0.0034 0.5961 0.3451 2.0864 1.7947 3.0619 6.9231 2.2271 0.3246 3.6542 4.1660 3.4513 0.8521 2.7646 3.8544 6.5085 20.1959 6.8711 0.1128 0.6439 24.6720 2.2346 5.0362 6.4823 7.4078 16.5078 19.9385 46.9621 3.9542 28.4339 5.5729 0.0300 2.7207 7.1262 0.3344 61.3744 34.5102 15.0741 28.1782 4.9733 19.4366 51.9619 131.1674 1.6571 3.0683 7.8009 16.5493 363.4966 4.1971 8.7894 60.2227 33.1197 199.5503 1.7867 0.8380 0.9946 0.2276 1.2090 4.5036 33.8863 2.0097 12.2949 25.3301 10.8642 4.9319 3.6689 25.9547 22.6987 19.9317 1.3712 29.6289 22.2978 2.1219 37.6070 12.7552 12.8927 10.8712 1.2476 7.2249 18.0132 7.7965 136.9806 8.1998 53.7521 166.1145 40.1081 9.3615 18.8508 82.4640 19.6622 22.5904 32.2560 11.9097 32.0453 21.4868 3.4200 11.7026 30.6471 68.5465 27.0579 76.3574 35.5156 30.5370 30.8753 16.7068 18.5104 22.3706 17.6767 4.9849
temp: 298.150 k
press: 1.00000 atm
elementType: 8 8 8 6 6 6 6 6 6 6 6 6 6 6 6 6 6 6 6 1 1 1 1 1 1 1 1 1 1 1 1 1 1 1 1 1 1 1 1 1 1 1 1
symmnumber: 1
zpe: 958289.2 jmol-1
zpe.correction: 0.364993 hartree
zpe.thermalcorrener: 0.386746 hartree
zpe.thermalcorrenthalpy: 0.387690 hartree
zpe.thermalcorrgfe: 0.310836 hartree
zpe.sumelectzpe: -848.302846 hartree
zpe.sumelectthermal: -848.281093 hartree
zpe.sumelectthermalent: -848.280149 hartree
zpe.sumelectthermalfe: -848.357002 hartree
dipole: -1.2894 -0.6049 -2.3966
dipole: 2.7879
quadrupole: -116.7476 -107.4067 -115.9880
quadrupole: 0.5322 -9.7693 5.2516
quadrupole: -3.3669 5.9741 -2.6072 0.5322 -9.7693 5.2516
hfenergy: -848.6678386 hartree
pointgroup: C01 [X(C16H24O3)]
dipole: 0.516205 -0.7269964 0.6388024 debye
polarizability: 244.8445066|3.7962196|171.4762286|13.1772179|4.119132|142.9366883 unknown
InChI: InChI=1S/C16H24O3/c1-5-12(3)14-7-9-15(10-8-14)18-11-13(4)19-16(17)6-2/h7-10,12-13H,5-6,11H2,1-4H3
charge 0 multiplicity 1
43 atoms
O  -0.687592 -0.144418 -1.179992
O  -3.367918 -0.568675 -0.039899
O  -5.00255 0.381786 -1.409936
C  4.948542 0.737462 -0.17941
C  5.339766 0.544841 1.316098
C  3.461479 0.472119 -0.43151
C  5.844549 -0.138769 -1.09529
C  2.887969 -0.802221 -0.198937
C  2.605648 1.498742 -0.911795
C  4.621047 1.514609 2.277532
C  0.687248 -0.012784 -0.909933
C  -2.79862 -1.307428 -1.214539
C  1.517747 -1.057083 -0.432213
C  1.236599 1.26888 -1.150545
C  -1.307796 -1.449209 -0.926756
C  -3.513921 -2.658543 -1.351401
C  -4.462452 0.270106 -0.285905
C  -4.855793 1.001844 0.987756
C  -6.190582 1.756358 0.855409
H  5.144721 1.800162 -0.434051
H  5.125623 -0.50166 1.614699
H  6.43713 0.67572 1.408253
H  6.913338 0.104188 -0.945456
H  5.598792 0.016738 -2.161149
H  5.709322 -1.214075 -0.872865
H  3.516614 -1.620907 0.172178
H  3.019371 2.497146 -1.099968
H  4.931069 1.341429 3.324544
H  4.853774 2.567054 2.026283
H  3.524623 1.390658 2.221004
H  -2.958658 -0.686743 -2.114454
H  -1.15317 -1.755302 0.127517
H  -0.867266 -2.216343 -1.5974
H  1.118135 -2.0578 -0.241297
H  0.57891 2.062288 -1.518916
H  -4.594685 -2.49853 -1.49795
H  -3.129309 -3.210916 -2.228184
H  -3.367068 -3.280361 -0.450284
H  -4.030832 1.699505 1.232972
H  -4.880993 0.26784 1.814396
H  -6.155165 2.47448 0.018919
H  -6.412725 2.30907 1.785266
H  -7.02372 1.060043 0.656906
