program: Gaussian 09
title: 000228672
version: EM64L-G09RevD.01
frameworkgroup: C1[X(C19H30O3)]
method: RPBEPBE
basis: SDD
operation: Freq
keyword: #pfreq=noraman
keyword: PBEPBE/SDD
title: #p freq=noraman PBEPBE/SDD
converged: YES YES NO NO
title: Mulliken charges:
elementType: O O O C C C C C C C C C C C C C C C C C C C H H H H H H H H H H H H H H H H H H H H H H H H H H H H H H
charge: -0.266868 -0.288392 -0.267150 -0.118482 -0.215759 -0.397907 -0.391295 -0.366824 0.547411 0.236542 0.017518 -0.718375 -0.339012 -0.695679 -0.705776 -0.488628 -0.378755 -0.699354 0.374840 -0.702108 -0.345322 -0.415252 0.219323 0.200132 0.201685 0.219511 0.221685 0.199437 0.195829 0.197149 0.221049 0.209048 0.227474 0.209905 0.216533 0.256356 0.205734 0.256011 0.214336 0.234081 0.216487 0.206753 0.232213 0.228313 0.234727 0.212703 0.203916 0.203599 0.231016 0.255885 0.247636 0.246099
chargesum: 0.00000
title: Mulliken charges with hydrogens summed into heavy atoms:
elementType: O O O C C C C C C C C C C C C C C C C C C C
charge: -0.266868 -0.288392 -0.267150 0.100840 -0.015626 0.023289 0.029828 0.026155 0.547411 0.236542 0.238567 -0.071948 0.133878 -0.019598 -0.048456 -0.256415 -0.150442 -0.048009 0.374840 -0.011607 -0.097685 -0.169153
polarizability: 2.61115620e+02 1.95095969e+01 2.11660763e+02 -7.57637297e+00 1.15933988e+01 1.73649697e+02
1716.lowfreq: -8.1482 -5.9018 0.0006 0.0008 0.0011 1.4483 8.7926 23.5157 32.5380
frequency: 8.6784 22.2687 32.5216 37.8890 39.2625 63.4408 67.8040 90.0771 92.4082 99.2870 116.3157 129.1003 141.8447 161.9086 174.9765 178.3414 206.5302 210.1649 217.6221 223.7341 228.7141 242.8729 250.5872 257.2363 299.8133 310.1703 355.0012 363.2968 375.0581 398.7126 404.3783 413.2690 429.4628 451.2992 462.8504 532.0591 550.2219 607.2736 628.2112 632.6246 687.4419 703.7824 733.3120 756.8853 769.5408 784.7505 791.4324 802.5103 820.5811 832.9068 848.4689 851.3689 881.8165 914.2775 927.4557 932.5096 941.7305 955.5320 960.4894 961.9418 992.7347 1003.0259 1020.0690 1029.0845 1047.9666 1049.2181 1057.9914 1066.5080 1088.5957 1099.8807 1103.3436 1108.5476 1114.7746 1124.5166 1151.3965 1152.9400 1160.9068 1185.3025 1203.2026 1215.4486 1238.7631 1244.9272 1253.4147 1256.8354 1272.2803 1285.3278 1297.4668 1315.9312 1316.7166 1321.3775 1328.3736 1334.7807 1335.9678 1354.9143 1363.5353 1384.6559 1384.7853 1389.0884 1390.2106 1396.0581 1396.6671 1416.5567 1456.2145 1461.9448 1464.7804 1469.2998 1471.0009 1473.8791 1474.5751 1474.9552 1476.8672 1477.8606 1480.2180 1483.0053 1485.4997 1487.3578 1498.2358 1582.4970 1615.0277 1619.9638 2963.6465 2970.8845 2973.8312 2975.3278 2976.4875 2977.4569 2983.3195 2987.8222 2992.0568 2999.2622 3006.4215 3008.6741 3020.0948 3030.8980 3045.1008 3066.2226 3068.6765 3072.0773 3073.9107 3077.1633 3078.7775 3080.7192 3094.7111 3096.6605 3109.3755 3117.2299 3117.2829 3121.6493 3154.7071 3160.8171
redmass: 3.7163 3.2881 4.2146 4.9500 3.7475 3.2928 3.6927 3.2754 2.2257 2.8281 2.3401 2.3916 3.1491 2.2044 2.9773 1.5944 1.2293 1.9871 1.1110 2.8595 1.4529 1.5007 2.1698 2.4110 2.8016 2.6664 3.6787 3.3761 2.9447 3.4425 3.2638 2.9893 3.2513 3.0685 3.2935 2.9820 2.5532 3.0790 2.6973 6.9022 3.2636 3.8122 3.3841 3.1187 1.3330 2.2920 1.9004 1.8235 1.3137 1.6224 1.6560 2.0306 2.6432 2.0308 2.1438 2.1605 1.4001 1.3420 2.2711 1.3429 1.8426 2.2914 1.7213 2.5521 1.5393 1.8969 2.8256 1.6144 3.2858 2.4196 2.0306 1.5708 2.1704 1.7146 2.0391 2.1688 2.0731 1.3729 1.6453 2.0743 1.2937 1.3243 1.3397 1.4349 1.1325 1.2932 1.2893 1.6251 1.3130 1.4398 1.4862 1.7863 1.4195 1.2970 1.4580 1.5634 1.5584 1.4699 1.2200 1.2509 1.2161 2.9774 1.0793 1.0461 1.0667 1.0570 1.0582 1.0596 1.0677 1.0484 1.0479 1.0783 1.0629 1.0650 1.0616 1.0492 2.3407 6.6763 8.7100 6.6209 1.0745 1.0640 1.0353 1.0401 1.0553 1.0387 1.0387 1.0608 1.0765 1.0436 1.0675 1.0849 1.1007 1.1009 1.0994 1.0996 1.0992 1.0996 1.0991 1.0995 1.0997 1.1006 1.0989 1.0984 1.0957 1.1008 1.0896 1.0883 1.0939 1.0951
irintensity: 0.0073 0.1542 0.4600 2.3349 0.2554 0.2576 0.1376 0.0919 0.3883 0.6119 0.0385 1.3604 0.6366 0.4347 0.5297 1.9153 0.9819 3.5981 0.0248 1.7830 1.5183 0.0067 0.3052 2.1175 8.3769 3.5245 0.0563 6.2590 0.8759 1.3771 0.7092 0.3491 0.7794 1.6024 3.9243 8.5319 23.3387 7.4435 0.5665 1.8755 14.0266 14.1879 2.7365 5.8306 0.6320 14.1235 2.0075 17.9639 10.9812 54.3883 6.2120 2.0387 4.2882 17.1889 0.0838 27.1827 1.7542 8.7485 78.9813 8.9373 14.8779 1.6193 2.9268 3.4025 14.9178 28.1122 0.7579 8.5693 162.0817 5.6852 44.9919 7.4195 47.7092 14.9665 7.2271 42.1772 23.7928 96.9500 101.3615 6.7484 3.2701 1.0575 21.4423 74.0096 0.3223 0.1052 11.4853 8.9938 17.2048 3.7798 0.1893 3.6050 1.8601 9.2013 16.4770 18.4795 8.4941 11.3377 16.7888 25.2283 14.3202 1.9149 3.4635 7.3949 3.0910 9.3216 14.6664 19.9516 1.1319 7.6135 12.0803 0.5897 23.1129 13.8747 10.1437 12.6895 166.9319 10.4822 111.3353 49.8913 10.6072 34.9393 67.7085 21.7310 21.0171 34.3104 20.8410 38.0949 5.8032 13.2064 87.6988 10.8523 26.6075 10.5761 10.8276 15.9225 73.0374 58.6100 67.7554 38.7776 49.2566 55.6459 34.6506 23.2721 11.6545 19.9380 11.7936 19.6520 8.3326 5.7543
temp: 298.150 k
press: 1.00000 atm
elementType: 8 8 8 6 6 6 6 6 6 6 6 6 6 6 6 6 6 6 6 6 6 6 1 1 1 1 1 1 1 1 1 1 1 1 1 1 1 1 1 1 1 1 1 1 1 1 1 1 1 1 1 1
symmnumber: 1
zpe: 1178169.5 jmol-1
zpe.correction: 0.448741 hartree
zpe.thermalcorrener: 0.474460 hartree
zpe.thermalcorrenthalpy: 0.475404 hartree
zpe.thermalcorrgfe: 0.390323 hartree
zpe.sumelectzpe: -965.969322 hartree
zpe.sumelectthermal: -965.943603 hartree
zpe.sumelectthermalent: -965.942659 hartree
zpe.sumelectthermalfe: -966.027740 hartree
dipole: 0.5357 -0.2769 0.6485
dipole: 0.8855
quadrupole: -126.4266 -127.9145 -138.5969
quadrupole: 5.4624 2.0575 -0.0583
quadrupole: 4.5527 3.0649 -7.6176 5.4624 2.0575 -0.0583
hfenergy: -966.4180635 hartree
pointgroup: C01 [X(C19H30O3)]
dipole: 0.2177857 -0.1256984 0.2411364 debye
polarizability: 257.2142203|24.5650115|211.5800036|-4.3413837|16.7006592|177.6318559 unknown
InChI: InChI=1S/C19H30O3/c1-6-14(4)17-9-11-18(12-10-17)21-13-15(5)22-19(20)16(7-2)8-3/h9-12,14-16H,6-8,13H2,1-5H3
charge 0 multiplicity 1
52 atoms
O  2.669249 0.846737 0.753132
O  0.116953 2.509374 0.575734
O  2.788273 0.357736 -1.52234
C  3.0106 -1.468053 0.141927
C  -4.324034 -0.948077 -0.807706
C  1.629086 -2.199089 0.21619
C  3.990653 -2.20892 -0.805298
C  -4.63214 -1.971894 0.325758
C  -3.131235 -0.050564 -0.46833
C  2.81864 -0.028516 -0.326311
C  2.594337 2.321436 0.465068
C  -5.586873 -0.111142 -1.144823
C  1.301068 2.728933 -0.264276
C  0.750254 -1.773079 1.409935
C  5.415003 -1.61439 -0.821859
C  -1.948919 -0.073764 -1.244526
C  -3.167726 0.838453 0.640909
C  -3.483903 -2.967294 0.592901
C  -0.904054 1.630835 0.155305
C  2.766961 2.995641 1.826912
C  -0.835441 0.748565 -0.948822
C  -2.076476 1.670043 0.950987
H  3.433124 -1.434017 1.164674
H  -4.055534 -1.533111 -1.712475
H  1.840606 -3.284722 0.283626
H  1.084994 -2.043311 -0.736372
H  3.571287 -2.197242 -1.829425
H  4.033872 -3.267561 -0.482163
H  -5.550429 -2.529865 0.051269
H  -4.870166 -1.419422 1.257461
H  3.434114 2.560268 -0.219601
H  -5.919716 0.477079 -0.268957
H  -5.387417 0.59741 -1.968639
H  -6.423818 -0.768964 -1.445985
H  1.353977 3.820615 -0.443994
H  1.228936 2.217344 -1.234947
H  1.25914 -1.983669 2.369328
H  0.516823 -0.695423 1.382003
H  -0.207304 -2.325572 1.403534
H  5.409205 -0.579457 -1.208978
H  6.081819 -2.208717 -1.472671
H  5.856739 -1.601741 0.192691
H  -1.885917 -0.753484 -2.103625
H  -4.063669 0.888725 1.271822
H  -2.56277 -2.436723 0.895206
H  -3.749732 -3.677244 1.397619
H  -3.250632 -3.556162 -0.314809
H  2.809875 4.092979 1.703679
H  3.699578 2.658219 2.308553
H  1.914809 2.751583 2.481682
H  0.059866 0.669787 -1.572872
H  -2.107638 2.359129 1.800894
