program: Gaussian 09
title: 000228657
version: EM64L-G09RevD.01
frameworkgroup: C1[X(C14H21NO)]
method: RPBEPBE
basis: SDD
operation: Freq
keyword: #p
keyword: freq=noraman
keyword: PBEPBE/SDD
title: #p freq=noraman PBEPBE/SDD
converged: YES YES NO NO
title: Mulliken charges:
elementType: O N C C C C C C C C C C C C C C H H H H H H H H H H H H H H H H H H H H H
charge: -0.287531 -0.406365 -0.012284 -0.237447 -0.365910 0.566580 -0.693790 0.272833 0.157823 -0.399958 -0.481716 -0.691568 -0.689521 -0.681086 -0.385881 -0.351045 0.243142 0.208799 0.181918 0.203151 0.288109 0.241770 0.195414 0.214198 0.232444 0.233671 0.212808 0.213719 0.227070 0.228156 0.213119 0.213451 0.220302 0.220513 0.212942 0.272228 0.209937
chargesum: 0.00000
title: Mulliken charges with hydrogens summed into heavy atoms:
elementType: O N C C C C C C C C C C C C C C
charge: -0.287531 -0.118256 0.230858 -0.028648 0.019160 0.566580 -0.042407 0.272833 0.157823 -0.167513 -0.248045 -0.037970 -0.034795 -0.027328 -0.113653 -0.141107
polarizability: 2.35686985e+02 -2.41579004e+00 1.39161056e+02 2.75747032e+00 1.61034674e+01 1.25297556e+02
1716.lowfreq: -10.6986 -6.1384 -0.0005 -0.0003 0.0004 6.0999 11.6061 19.6510 40.3278
frequency: -7.7139 18.7620 40.0928 49.0590 70.3853 97.5377 113.6659 160.5914 189.2687 197.1185 211.1671 218.0406 219.3237 249.5667 265.2492 287.6843 332.1572 349.4693 383.1030 405.8535 410.7207 456.1595 482.4318 505.8750 547.9437 560.8133 591.9198 634.1633 691.4972 738.6157 766.4391 772.6277 809.5937 838.5177 862.0580 869.4190 890.0004 913.9749 919.8871 954.3595 958.4495 969.9368 994.9676 998.0061 1011.6533 1038.7873 1050.7894 1111.1685 1112.7563 1114.6880 1117.3646 1155.6509 1160.1897 1169.9647 1196.3578 1222.1612 1242.9536 1275.1342 1293.8403 1299.1250 1304.9478 1327.0761 1335.2678 1349.8632 1378.7967 1383.3852 1386.6521 1391.4489 1397.1543 1408.6094 1459.1193 1464.6848 1467.2475 1468.1477 1473.8702 1475.5074 1479.2963 1482.7397 1485.9256 1489.1410 1509.5869 1561.9490 1599.4427 1619.1914 2958.2965 2975.4202 2975.4686 2977.7874 2979.4095 2981.8561 3019.9389 3036.3740 3068.8993 3071.5262 3075.6908 3078.4730 3078.6550 3080.7885 3082.8831 3092.0878 3109.1625 3127.5822 3133.9147 3160.1524 3542.7185
redmass: 3.0260 3.7958 3.2894 4.0692 4.3692 2.6461 2.1607 2.8793 2.6972 3.1636 1.0976 1.2487 1.2024 1.1331 2.4294 3.3843 3.0115 3.8596 3.0247 2.7866 3.0093 2.8231 2.4006 3.5279 2.8867 1.3952 3.4171 6.7240 3.9559 4.1751 3.4927 1.3251 2.9710 1.4589 2.3804 1.5220 2.5797 2.0318 1.1754 1.4317 1.4203 1.2391 1.3732 1.5441 2.8779 3.3143 1.5898 2.5635 2.4246 1.9241 1.8723 1.7324 2.2700 2.1726 1.1412 2.0095 1.4421 1.6970 1.5926 1.2697 1.3207 1.7055 1.5231 1.4133 1.1919 1.2156 3.3356 1.2130 1.2419 2.7646 1.2237 1.1309 1.0464 1.0484 1.0488 1.0450 1.0495 1.2530 1.0599 1.2443 2.3269 6.8375 7.1799 6.3268 1.0639 1.0349 1.0370 1.0391 1.0802 1.0361 1.0921 1.0892 1.1002 1.0982 1.0993 1.0998 1.1005 1.0996 1.0997 1.0998 1.0866 1.0887 1.0958 1.0952 1.0764
irintensity: 0.4189 3.1806 0.0666 2.3046 2.2176 0.3594 0.0242 0.8286 2.9328 3.1269 0.3523 0.2931 0.1477 0.9610 1.4776 10.7166 1.0418 3.6484 1.2775 0.7133 1.7165 3.8020 3.2069 1.6087 6.3524 107.1848 4.3558 1.6528 29.4467 3.1767 4.6592 14.4116 4.9558 17.3905 3.0728 24.7353 2.9021 3.3317 2.8431 0.1768 0.1867 11.8895 3.2383 11.6759 13.8667 4.2388 26.8290 1.4371 6.3439 6.4791 29.8844 1.0004 13.2677 41.9642 17.2922 2.2322 14.0067 129.5769 0.6989 0.1238 0.7250 11.1894 24.8351 22.0898 15.3148 16.0001 0.9356 14.9833 10.0242 2.3418 119.9502 76.7963 5.6173 0.6809 1.6265 16.4647 16.0447 29.8333 18.7232 112.1351 48.3267 65.3181 94.8652 31.0989 38.0690 22.8919 48.6143 37.1299 18.6650 25.4357 15.2154 9.2627 0.4749 31.4474 99.8446 44.2270 24.9131 73.1068 39.1779 35.1544 19.5584 22.4800 18.1572 4.7158 8.8795
temp: 298.150 k
press: 1.00000 atm
elementType: 8 7 6 6 6 6 6 6 6 6 6 6 6 6 6 6 1 1 1 1 1 1 1 1 1 1 1 1 1 1 1 1 1 1 1 1 1
symmnumber: 1
zpe: 836639.4 jmol-1
zpe.correction: 0.318659 hartree
zpe.thermalcorrener: 0.335664 hartree
zpe.thermalcorrenthalpy: 0.336608 hartree
zpe.thermalcorrgfe: 0.272962 hartree
zpe.sumelectzpe: -674.864489 hartree
zpe.sumelectthermal: -674.847485 hartree
zpe.sumelectthermalent: -674.846540 hartree
zpe.sumelectthermalfe: -674.910187 hartree
dipole: -0.8094 2.3538 3.0971
dipole: 3.9733
quadrupole: -82.2228 -98.8987 -101.8901
quadrupole: 3.7874 5.7031 0.4162
quadrupole: 12.1144 -4.5615 -7.5529 3.7874 5.7031 0.4162
hfenergy: -675.1831484 hartree
pointgroup: C01 [X(C14H21N1O1)]
dipole: 0.3179963 -1.1448361 1.0158352 debye
polarizability: 235.7138316|-1.5767356|144.7788826|-2.7817004|-12.2466144|119.6528826 unknown
InChI: InChI=1S/C14H21NO/c1-5-11(4)15-14(16)13-8-6-12(7-9-13)10(2)3/h6-11,15H,5H2,1-4H3
charge 0 multiplicity 1
37 atoms
O  -1.770659 1.646225 -1.079403
N  -2.376417 -0.040399 0.407543
C  -3.82939 0.223478 0.327092
C  4.277738 -0.649782 0.329069
C  -4.611344 -1.097831 0.111276
C  2.792143 -0.317537 0.172062
C  -4.31619 0.986709 1.581605
C  0.00626 0.293278 -0.117171
C  -1.437603 0.68814 -0.308171
C  2.36609 0.936653 -0.343278
C  1.795944 -1.261957 0.525841
C  4.979598 0.325053 1.31236
C  5.003722 -0.666699 -1.043287
C  -4.270782 -1.804955 -1.216755
C  0.998991 1.23529 -0.490696
C  0.422438 -0.966228 0.384898
H  -3.954701 0.874608 -0.557546
H  4.348875 -1.669411 0.759105
H  -4.419065 -1.779418 0.9676
H  -5.693011 -0.861466 0.143958
H  -2.057606 -0.715146 1.105487
H  -3.74703 1.923613 1.708769
H  -4.191689 0.37483 2.496047
H  -5.387648 1.242075 1.487814
H  3.111636 1.686467 -0.633836
H  2.100979 -2.244354 0.907207
H  4.95211 1.362638 0.930971
H  6.040425 0.042879 1.445932
H  4.490275 0.31639 2.302887
H  4.533165 -1.387039 -1.736237
H  6.065578 -0.948183 -0.916342
H  4.972754 0.330304 -1.520453
H  -4.522191 -1.162435 -2.080541
H  -3.191773 -2.035315 -1.279291
H  -4.830953 -2.751992 -1.321203
H  0.664534 2.193482 -0.901873
H  -0.310901 -1.743063 0.635658
