program: Gaussian 09
title: 000228655
version: EM64L-G09RevD.01
frameworkgroup: C1[X(C9H11Cl3O6)]
method: RPBEPBE
basis: SDD
operation: Freq
keyword: #p
keyword: freq=noraman
keyword: PBEPBE/SDD
title: #p freq=noraman PBEPBE/SDD
converged: YES YES NO NO
title: Mulliken charges:
elementType: Cl Cl Cl O O O O O O C C C C C C C C C H H H H H H H H H H H
charge: -0.006135 -0.011815 -0.011067 -0.285655 -0.241066 -0.263339 -0.209780 -0.227624 -0.197269 -0.032960 -0.333687 -0.373878 0.386445 0.378971 0.376891 -0.696517 -0.698101 -0.704965 0.311700 0.255787 0.257894 0.248128 0.263233 0.297049 0.293112 0.320046 0.290877 0.325928 0.287798
chargesum: 0.00000
title: Mulliken charges with hydrogens summed into heavy atoms:
elementType: Cl Cl Cl O O O O O O C C C C C C C C C
charge: -0.006135 -0.011815 -0.011067 -0.285655 -0.241066 -0.263339 -0.209780 -0.227624 -0.197269 0.278740 0.179993 0.137483 0.386445 0.378971 0.376891 -0.106356 -0.087178 -0.091238
polarizability: 1.70348904e+02 -5.63676662e+00 1.35236404e+02 5.49948134e+00 -1.36100749e+01 1.12271096e+02
1716.lowfreq: -9.8580 -5.0955 -1.7737 -0.0013 0.0019 0.0023 5.0023 16.3054 25.3592
frequency: -9.1347 16.1481 25.3073 26.8999 36.1936 49.5518 65.8183 67.9466 86.5322 89.5028 112.9197 145.1577 149.7501 192.9412 203.6436 229.0773 256.1059 268.9244 297.3446 304.3737 349.3413 371.4637 426.1005 486.7760 514.2635 539.7173 545.3817 558.5450 650.8361 658.3753 664.3906 728.3739 736.0396 738.7084 803.8843 817.3658 835.2279 880.8986 915.2306 916.7268 918.5947 931.9260 965.5390 979.1897 1036.1993 1073.4062 1084.4494 1105.0712 1117.5020 1130.6670 1166.3113 1171.7796 1177.0126 1221.8298 1256.2007 1283.6810 1289.1556 1291.5052 1314.1145 1339.3734 1362.8159 1379.5056 1425.0382 1426.8702 1428.2848 1437.7695 1460.9440 1662.6927 1674.1211 1684.6218 3038.9137 3048.1975 3051.6481 3055.2077 3056.9997 3060.4301 3124.4822 3129.5741 3141.8693 3144.3336 3151.4489
redmass: 7.8108 16.4205 15.9904 8.9503 6.0529 9.2958 6.9735 4.0167 3.9731 6.3567 7.6840 9.1122 6.3075 5.5664 7.2075 8.4018 6.9923 8.7982 4.8127 3.4433 6.6419 4.1329 2.9918 4.7992 4.3517 3.4664 3.4875 4.0157 5.2181 5.8567 6.8323 6.1309 6.1582 6.2942 4.9830 4.5358 5.3814 3.4179 1.8154 1.7795 1.8188 3.1385 6.8647 4.7884 2.6945 3.2150 2.9574 2.4997 2.6791 2.7593 1.2143 1.2377 1.3141 1.1902 1.1236 1.3539 1.3649 1.4192 1.2110 1.2178 1.3288 1.3612 1.0883 1.0928 1.0870 1.0898 1.0948 10.2778 10.8152 10.5442 1.0593 1.0602 1.0596 1.0591 1.0824 1.0591 1.1063 1.1086 1.1052 1.1050 1.1059
irintensity: 2.7208 0.3754 0.4896 0.5855 1.1529 0.1712 1.7895 10.5080 6.7939 2.0637 0.0695 0.4270 3.9863 2.4759 0.7134 5.1895 5.5128 8.3514 13.8221 4.1729 12.4588 13.4717 8.5733 9.2965 8.2209 2.5992 3.2760 24.1607 13.1620 27.3667 6.7911 36.6158 25.4513 28.2927 13.4547 1.0546 22.7908 27.2992 3.9160 10.4032 11.5698 45.8459 99.7455 38.7632 93.9513 325.5001 77.6963 255.8213 50.6867 10.9178 20.2282 59.4017 58.0586 3.8539 14.3213 23.1610 10.9587 19.5522 11.8834 12.1674 1.4299 2.6910 34.0081 32.8536 26.3860 17.9718 18.4566 156.9271 116.7016 145.9389 13.1615 18.5783 2.5616 5.4406 6.4819 6.0906 3.5720 5.0793 1.0930 1.9956 1.1259
temp: 298.150 k
press: 1.00000 atm
elementType: 17 17 17 8 8 8 8 8 8 6 6 6 6 6 6 6 6 6 1 1 1 1 1 1 1 1 1 1 1
symmnumber: 1
zpe: 523731.5 jmol-1
zpe.correction: 0.199479 hartree
zpe.thermalcorrener: 0.218842 hartree
zpe.thermalcorrenthalpy: 0.219786 hartree
zpe.thermalcorrgfe: 0.146125 hartree
zpe.sumelectzpe: -2179.674400 hartree
zpe.sumelectthermal: -2179.655037 hartree
zpe.sumelectthermalent: -2179.654092 hartree
zpe.sumelectthermalfe: -2179.727753 hartree
dipole: 2.3579 -3.5434 4.8868
dipole: 6.4804
quadrupole: -139.4827 -123.8842 -125.3947
quadrupole: -4.5917 -6.0450 -1.5006
quadrupole: -9.8955 5.7030 4.1925 -4.5917 -6.0450 -1.5006
hfenergy: -2179.8738784 hartree
pointgroup: C01 [X(C9H11Cl3O6)]
dipole: -1.3187632 -0.6635875 2.0787015 debye
polarizability: 136.0562237|14.2668835|165.5011554|-16.9041667|-0.6910059|116.2990259 unknown
InChI: InChI=1S/C9H11Cl3O6/c10-1-7(13)16-4-6(18-9(15)3-12)5-17-8(14)2-11/h6H,1-5H2
charge 0 multiplicity 1
29 atoms
Cl -2.01626 -4.798875 -1.187278
Cl 4.525448 -1.136506 -1.426665
Cl 0.875345 5.19844 -1.255754
O  -1.730563 -1.192821 0.41959
O  1.33668 -1.298561 0.992863
O  -0.677358 2.328431 1.042017
O  -0.468533 -2.054941 -1.359148
O  2.216443 0.543356 -0.141575
O  -0.982921 2.644486 -1.257082
C  -0.774293 -0.054244 0.557367
C  0.310348 -0.403004 1.585139
C  -1.604148 1.166193 0.990531
C  -1.460498 -2.112053 -0.61264
C  2.188534 -0.686414 0.061455
C  -0.370223 2.911928 -0.210689
C  -2.60541 -3.111911 -0.660386
C  2.96772 -1.779848 -0.644064
C  0.835629 3.810569 -0.017415
H  -0.324441 0.139393 -0.43215
H  -0.104668 -0.979673 2.425912
H  0.791535 0.524718 1.941217
H  -2.001603 1.07346 2.01272
H  -2.415198 1.354576 0.267622
H  -3.347462 -2.791859 -1.40893
H  -3.078274 -3.212288 0.324993
H  2.336997 -2.193567 -1.448047
H  3.244563 -2.576976 0.059093
H  1.745546 3.206729 -0.172213
H  0.838765 4.254561 0.98682
