program: Gaussian 09
title: 000228652
version: EM64L-G09RevD.01
frameworkgroup: C1[X(C17H17ClO3)]
method: RPBEPBE
basis: SDD
operation: Freq
keyword: #p
keyword: freq=noraman
keyword: PBEPBE/SDD
title: #p freq=noraman PBEPBE/SDD
converged: YES YES NO NO
title: Mulliken charges:
elementType: Cl O O O C C C C C C C C C C C C C C C C C H H H H H H H H H H H H H H H H H
charge: -0.074940 -0.268997 -0.277712 -0.246622 0.010643 -0.365461 -0.688154 -0.652019 0.439529 0.274332 0.370024 -0.417574 -0.370446 -0.307486 -0.370379 -0.237338 -0.215707 -0.243570 -0.173584 -0.191238 -0.142525 0.240293 0.236052 0.245609 0.228141 0.214890 0.252505 0.244481 0.249031 0.241464 0.264049 0.253121 0.256415 0.238377 0.229295 0.233358 0.267243 0.254901
chargesum: 0.00000
title: Mulliken charges with hydrogens summed into heavy atoms:
elementType: Cl O O O C C C C C C C C C C C C C C C C C
charge: -0.074940 -0.268997 -0.277712 -0.246622 0.250936 0.116201 0.007382 -0.158507 0.439529 0.274332 0.370024 -0.176109 -0.106397 -0.054365 -0.113964 0.001038 0.013588 -0.010212 0.093659 0.063663 -0.142525
polarizability: 2.18375253e+02 3.03101496e+01 2.26314556e+02 2.15519685e+01 -6.88018944e+00 1.36057202e+02
1716.lowfreq: -4.8840 -0.0016 0.0003 0.0010 4.5252 6.7648 13.6302 17.2951 28.6106
frequency: 9.8302 16.9834 28.3474 33.1260 45.9926 54.0254 66.9479 106.7117 116.1038 175.5984 177.6775 206.3252 215.0765 229.6836 271.7472 300.2591 311.6946 323.2792 351.6132 386.8629 403.0405 412.1454 418.6753 462.1413 464.9512 497.6601 518.4263 577.4259 595.6925 618.3961 622.6463 639.0709 693.4019 697.6381 714.8511 745.1903 758.2575 781.0401 800.1433 821.0360 825.3849 857.2140 859.9014 912.3729 923.2903 927.2584 930.8992 947.5038 949.3621 963.6727 980.8494 989.3737 989.7422 999.5643 1027.7734 1062.6379 1071.0033 1077.3253 1089.3102 1105.7399 1119.2280 1161.3587 1173.1731 1173.5115 1190.2955 1201.7270 1204.5533 1227.0484 1259.8336 1286.4799 1288.7078 1317.1227 1333.8537 1341.1947 1366.8896 1371.6847 1382.9552 1397.1797 1401.8894 1441.1077 1452.3045 1458.9869 1464.5322 1469.3631 1473.7909 1483.6850 1586.4456 1593.5244 1600.5548 1609.9343 1628.3896 3003.4457 3005.3255 3012.1794 3021.5146 3073.4192 3098.5603 3099.0163 3119.4329 3121.6951 3129.2813 3140.5163 3150.1609 3157.3653 3165.8382 3166.2965 3177.3034 3190.0686
redmass: 4.4068 6.8096 6.8657 5.6260 3.8949 4.4597 6.4355 6.7147 6.3425 3.0535 2.6040 1.9669 2.5169 5.6387 5.9296 4.4817 4.1532 3.4485 6.2519 3.3868 2.8367 2.7780 2.6723 4.0312 3.2489 2.8410 5.4627 4.4743 4.4808 5.9340 7.0899 4.3334 3.5029 3.3051 2.0961 4.3267 2.3123 3.7995 1.2940 1.5431 3.9208 1.2992 3.0829 2.7482 2.0700 1.7046 1.3511 1.9627 1.3459 2.7006 1.3954 4.2247 5.3592 1.3187 2.2370 2.0922 2.4514 1.8442 1.7413 1.4223 1.5489 2.2844 1.1530 1.0975 1.1465 2.6441 2.3732 1.5633 1.3819 1.2568 1.5341 1.5477 1.2779 1.3163 1.2488 5.8393 7.4877 1.2484 3.8956 1.9868 1.1580 1.0690 1.0546 1.8413 1.2152 2.2198 7.4386 6.1402 6.8065 6.1704 9.5013 1.0367 1.0625 1.0626 1.0802 1.1061 1.0992 1.0989 1.1008 1.0862 1.0871 1.0923 1.0963 1.0883 1.1015 1.0898 1.0974 1.0944
irintensity: 0.1351 0.8127 0.1996 1.1983 0.1782 0.2444 0.5191 0.4235 1.4634 2.5381 3.1243 0.5815 6.8895 3.0316 0.0546 4.0067 2.0466 6.6584 2.3092 5.4124 0.3215 1.7570 2.9358 2.6812 4.2847 19.1053 12.3357 34.2680 8.5784 1.3040 6.4101 15.3074 0.2710 17.5005 45.2013 19.0315 49.0695 0.7364 5.7496 66.6863 7.6679 0.8476 4.2488 60.2914 8.0710 3.6314 0.0463 12.8874 0.3786 64.7891 0.3100 28.5392 11.9766 0.3222 7.6336 66.5498 42.9620 65.6214 99.7755 15.6753 68.8571 4.3182 40.8660 17.7952 3.1493 9.2864 129.9585 104.0258 58.4098 1.1557 61.2864 6.6751 10.5404 8.1980 20.6986 5.5592 2.0766 27.4772 1.0678 7.1769 20.8158 5.9581 17.6775 141.8472 58.9106 25.5105 9.9913 4.1870 12.0373 24.0851 143.4067 16.7233 13.4533 10.2125 27.6158 19.1363 4.5433 22.8305 21.2019 3.7403 0.2914 16.4963 22.9977 2.8794 16.5519 4.0950 5.0807 2.3605
temp: 298.150 k
press: 1.00000 atm
elementType: 17 8 8 8 6 6 6 6 6 6 6 6 6 6 6 6 6 6 6 6 6 1 1 1 1 1 1 1 1 1 1 1 1 1 1 1 1 1
symmnumber: 1
zpe: 780279.9 jmol-1
zpe.correction: 0.297193 hartree
zpe.thermalcorrener: 0.317182 hartree
zpe.thermalcorrenthalpy: 0.318126 hartree
zpe.thermalcorrgfe: 0.244002 hartree
zpe.sumelectzpe: -1342.211875 hartree
zpe.sumelectthermal: -1342.191886 hartree
zpe.sumelectthermalent: -1342.190942 hartree
zpe.sumelectthermalfe: -1342.265066 hartree
dipole: -2.0127 -1.1648 0.4759
dipole: 2.3737
quadrupole: -138.6596 -117.5232 -128.4294
quadrupole: -0.6147 -2.6910 -1.2868
quadrupole: -10.4555 10.6809 -0.2254 -0.6147 -2.6910 -1.2868
hfenergy: -1342.5090677 hartree
pointgroup: C01 [X(C17H17Cl1O3)]
dipole: -0.2618957 0.8655614 -0.233107 debye
polarizability: 192.789662|0.7508721|253.4950573|-19.1328492|4.3408234|134.4622922 unknown
InChI: InChI=1S/C17H17ClO3/c1-13(12-20-16-9-7-15(18)8-10-16)21-17(19)11-14-5-3-2-4-6-14/h2-10,13H,11-12H2,1H3
charge 0 multiplicity 1
38 atoms
Cl 2.556384 -4.319183 -0.059558
O  -0.234178 2.26509 -0.871159
O  2.521484 1.666387 0.713097
O  -1.967725 2.808761 0.596913
C  0.689494 3.188506 -0.118239
C  1.341688 2.463622 1.07587
C  1.685819 3.722398 -1.146416
C  -2.379858 1.244719 -1.275847
C  -2.674145 -0.08042 -0.566274
C  -1.551904 2.185664 -0.408947
C  2.424554 0.275267 0.527112
C  -2.251714 -1.305098 -1.140051
C  -3.381314 -0.102467 0.664069
C  1.21696 -0.45664 0.43133
C  3.672035 -0.392867 0.435125
C  -2.539454 -2.535136 -0.502981
C  -3.663797 -1.330108 1.302712
C  -3.24684 -2.550752 0.720754
C  1.261515 -1.859624 0.258493
C  3.717429 -1.789037 0.252829
C  2.505945 -2.50625 0.171743
H  0.058491 3.995655 0.302505
H  1.741225 3.235961 1.757716
H  0.597946 1.86292 1.630825
H  1.155135 4.254837 -1.953147
H  2.388234 4.423886 -0.661629
H  2.274066 2.899263 -1.581908
H  -1.849294 1.064724 -2.223584
H  -3.329694 1.766733 -1.496636
H  -1.697838 -1.298225 -2.086534
H  -3.69875 0.842581 1.119434
H  0.242277 0.034556 0.460982
H  4.59212 0.193533 0.513465
H  -2.21503 -3.475466 -0.962928
H  -4.21121 -1.335267 2.251932
H  -3.470414 -3.50231 1.215596
H  0.328117 -2.424691 0.186217
H  4.677538 -2.308024 0.181622
