program: Gaussian 09
title: 000228656
version: EM64L-G09RevD.01
frameworkgroup: C1[X(C21H26O3)]
method: RPBEPBE
basis: SDD
operation: Freq
keyword: #pfreq=noraman
keyword: PBEPBE/SDD
title: #p freq=noraman PBEPBE/SDD
converged: YES YES NO NO
title: Mulliken charges:
elementType: O O O C C C C C C C C C C C C C C C C C C C C C H H H H H H H H H H H H H H H H H H H H H H H H H H
charge: -0.279780 -0.259386 -0.248040 -0.216829 -0.364314 0.548137 -0.718950 -0.381877 -0.494638 -0.693999 0.385338 0.019885 -0.407670 -0.332090 -0.360131 -0.700790 -0.658269 0.286783 0.440388 -0.396488 -0.362229 -0.222703 -0.224524 -0.240291 0.200267 0.196076 0.197116 0.208218 0.227745 0.210454 0.229583 0.233359 0.229971 0.203126 0.213227 0.234586 0.245871 0.235640 0.244967 0.226979 0.252849 0.206624 0.233683 0.251557 0.233525 0.236950 0.248956 0.226513 0.225827 0.228802
chargesum: 0.00000
title: Mulliken charges with hydrogens summed into heavy atoms:
elementType: O O O C C C C C C C C C C C C C C C C C C C C C
charge: -0.279780 -0.259386 -0.248040 -0.016562 0.028877 0.548137 -0.072534 -0.152294 -0.261279 -0.047676 0.385338 0.254471 -0.161799 -0.096450 0.111815 -0.007635 -0.173187 0.286783 0.440388 -0.159538 -0.113273 0.003810 0.001304 -0.011490
polarizability: 2.67686144e+02 -7.60620757e+00 2.19172415e+02 -4.63324465e+00 -1.17799943e+01 2.08347930e+02
1716.lowfreq: -12.6461 -5.3781 -3.1751 -0.0008 0.0002 0.0007 5.4591 9.3133 19.3547
frequency: -4.3886 8.7098 19.2114 22.7921 30.4469 43.0445 59.1421 67.0573 78.7751 94.2736 111.1287 157.8353 161.2452 171.7336 194.8552 212.0434 214.7019 227.7207 234.4242 246.8588 269.4660 285.6099 340.2507 356.7820 383.5403 402.0999 403.1524 412.2140 415.8186 437.0698 461.0902 467.4141 513.4236 541.3414 549.5098 602.6548 615.3238 617.3009 632.6905 672.9976 694.9073 708.2708 734.4371 753.3492 765.1069 783.4525 800.6177 822.7850 827.1973 833.5414 850.6513 852.4036 858.9925 911.7914 926.7519 933.1392 941.7887 943.5019 956.6392 961.6131 964.6975 976.9378 990.0393 993.6412 995.1973 1002.0969 1027.2391 1029.2537 1053.1935 1067.2966 1073.1899 1098.3646 1101.1557 1112.0696 1122.2659 1150.8109 1159.5206 1172.5876 1176.6195 1189.0175 1199.3451 1203.4657 1214.7356 1229.5482 1244.9661 1255.0706 1282.4579 1284.9696 1296.5046 1316.1594 1323.5091 1326.9031 1328.9464 1335.4176 1360.7643 1383.5031 1384.9930 1385.8288 1390.0649 1394.2590 1415.1655 1440.4536 1455.3897 1461.8315 1463.8931 1472.6805 1473.2220 1475.6522 1477.6698 1478.0672 1483.0376 1483.6964 1496.0250 1582.6902 1594.5412 1610.0133 1619.1941 1630.1558 2962.3889 2970.2348 2973.7846 2975.2295 2999.9242 3006.2190 3019.4753 3021.7626 3025.4613 3065.9907 3068.4825 3076.8961 3079.4297 3081.9556 3096.2771 3099.3292 3116.0189 3117.7109 3121.9682 3122.1795 3127.2059 3139.3895 3149.3167 3156.0990 3161.0296 3164.4977
redmass: 3.8447 4.7273 4.4168 3.5970 4.4625 4.4880 3.9509 3.3896 6.8775 5.2285 2.1951 3.1133 2.6439 3.0313 2.5723 1.2793 1.2307 2.6375 1.9099 2.1758 4.5679 3.6673 2.7476 3.2900 3.4225 3.4883 2.8153 2.8071 2.4726 3.0987 3.3410 3.6091 5.0605 3.1939 2.3704 4.6383 3.3165 6.2620 6.5815 3.4068 3.6481 1.7931 3.3594 2.5767 3.0542 2.4372 1.5530 1.3281 3.3107 1.6842 2.0462 1.2571 3.3175 2.0509 1.9505 2.3860 1.6131 1.5896 1.3066 1.3861 2.3154 1.3906 5.9239 1.9572 1.3295 2.1267 2.2364 2.5548 1.9362 1.6018 1.7903 1.9911 2.1285 1.5724 1.5285 1.8985 2.1482 1.0545 1.4149 1.1358 1.9146 2.1543 2.1879 1.7903 1.3395 1.4650 1.4227 1.3183 1.2492 1.5944 1.4163 1.5344 1.2624 1.7023 1.2410 8.1003 2.3285 1.2507 1.3847 1.2535 3.0183 2.1595 1.1154 1.0469 1.0711 1.0731 1.0464 1.0618 1.0587 1.0776 2.1440 1.0753 2.3611 6.8518 6.1848 6.2975 6.5619 9.3966 1.0741 1.0656 1.0360 1.0383 1.0385 1.0759 1.1010 1.0651 1.0597 1.0995 1.0990 1.1000 1.0998 1.1057 1.0987 1.1028 1.1009 1.0890 1.0849 1.0883 1.0877 1.0923 1.0966 1.0935 1.0951 1.1017
irintensity: 0.0346 0.0309 0.1279 0.1104 0.5860 1.0668 0.1187 0.1464 1.2039 1.0286 0.0279 0.3449 2.5709 2.3662 0.8680 1.1020 0.8173 1.8507 1.4248 0.5663 2.3428 5.8089 0.7640 2.4079 5.5577 1.4761 0.0777 0.5851 3.4286 0.4073 3.8108 2.8620 16.2991 3.8879 29.0187 9.1138 8.6120 0.1975 2.5619 9.4269 11.0773 49.6328 5.0978 34.1508 11.0000 1.7560 14.3710 10.5029 4.2037 63.4149 3.7579 0.4667 7.0287 12.1053 22.9185 36.5257 1.0398 1.5505 4.8136 12.5398 66.2607 0.2747 0.5082 16.1506 0.1356 1.2806 8.4527 2.9327 25.6132 8.7581 32.9151 51.4250 63.6792 29.2174 25.8521 2.1604 16.9125 0.9013 101.0971 0.4410 61.9547 36.1984 21.4481 141.5292 1.5992 103.2492 16.2951 0.5758 8.4703 11.3882 1.3439 0.2071 0.3168 4.8136 14.3150 0.4761 26.2889 2.4806 12.6049 32.1926 3.0351 7.6581 16.6257 4.9409 2.6234 10.7777 5.8010 12.7411 24.2842 3.1522 22.2482 4.9326 157.1905 9.6576 5.0158 34.1101 48.4281 136.4117 10.9323 37.9993 53.3010 30.4208 13.5624 4.9995 32.1663 53.3029 11.2322 12.7776 79.2663 58.8966 48.0834 13.3767 28.1286 5.0975 19.8563 14.3457 3.2649 20.3068 0.2414 19.8956 36.8860 15.2902 4.7363 19.3457
temp: 298.150 k
press: 1.00000 atm
elementType: 8 8 8 6 6 6 6 6 6 6 6 6 6 6 6 6 6 6 6 6 6 6 6 6 1 1 1 1 1 1 1 1 1 1 1 1 1 1 1 1 1 1 1 1 1 1 1 1 1 1
symmnumber: 1
zpe: 1095808.8 jmol-1
zpe.correction: 0.417372 hartree
zpe.thermalcorrener: 0.441077 hartree
zpe.thermalcorrenthalpy: 0.442021 hartree
zpe.thermalcorrgfe: 0.360260 hartree
zpe.sumelectzpe: -1039.719009 hartree
zpe.sumelectthermal: -1039.695303 hartree
zpe.sumelectthermalent: -1039.694359 hartree
zpe.sumelectthermalfe: -1039.776120 hartree
dipole: -0.5613 -0.4372 -1.0103
dipole: 1.2357
quadrupole: -136.3943 -137.9427 -141.9047
quadrupole: -3.8235 3.1663 -4.9063
quadrupole: 2.3529 0.8045 -3.1574 -3.8235 3.1663 -4.9063
hfenergy: -1040.1363802 hartree
pointgroup: C01 [X(C21H26O3)]
dipole: 0.2228397 0.1955493 -0.3852857 debye
polarizability: 267.1975862|2.9647247|219.8179704|8.8962459|12.3214905|208.190932 unknown
InChI: InChI=1S/C21H26O3/c1-4-16(2)19-10-12-20(13-11-19)23-15-17(3)24-21(22)14-18-8-6-5-7-9-18/h5-13,16-17H,4,14-15H2,1-3H3
charge 0 multiplicity 1
50 atoms
O  -0.371459 -3.127565 -0.149104
O  1.64648 -0.898465 0.266698
O  1.811947 -0.67153 2.58286
C  -4.880911 0.513086 -0.088185
C  -4.796937 1.538878 -1.258893
C  -3.681685 -0.437921 -0.071243
C  -6.225533 -0.259648 -0.135869
C  -3.452604 -1.359247 -1.129779
C  -2.750329 -0.425992 0.993435
C  -3.570286 2.47202 -1.182444
C  -1.422405 -2.190924 -0.046125
C  1.950655 -2.366699 0.374754
C  -2.345167 -2.226557 -1.121183
C  -1.625598 -1.284897 1.020868
C  0.707666 -3.146027 0.845275
C  2.453954 -2.781914 -1.007462
C  1.404094 1.317729 1.160404
C  1.637705 -0.160949 1.450825
C  2.675602 2.002021 0.655246
C  3.487449 2.750307 1.543726
C  3.067497 1.886142 -0.702915
C  4.668559 3.376674 1.083446
C  4.24548 2.513995 -1.164629
C  5.050291 3.261707 -0.272774
H  -4.859993 1.095052 0.857273
H  -5.725418 2.145336 -1.257516
H  -4.785728 0.987353 -2.221072
H  -6.322094 -0.834859 -1.075889
H  -6.306408 -0.972675 0.704039
H  -7.0805 0.440252 -0.081982
H  -4.149338 -1.403381 -1.975727
H  -2.899127 0.272439 1.826512
H  -2.628985 1.894177 -1.21795
H  -3.573171 3.054187 -0.240997
H  -3.562264 3.190082 -2.022966
H  2.731426 -2.488062 1.152068
H  -2.172413 -2.938738 -1.934277
H  -0.938421 -1.229594 1.870565
H  0.3699 -2.789801 1.83331
H  0.989052 -4.210882 0.937018
H  1.654285 -2.669756 -1.757384
H  2.770132 -3.840701 -0.992054
H  3.317328 -2.162624 -1.302718
H  0.599901 1.394933 0.407736
H  1.062218 1.784519 2.098327
H  3.195974 2.840565 2.597025
H  2.449708 1.298543 -1.39154
H  5.286253 3.953799 1.780735
H  4.534784 2.422081 -2.217688
H  5.963534 3.749732 -0.631379
