program: Gaussian 09
title: 000228650
version: EM64L-G09RevD.01
frameworkgroup: C1[X(C13H24O2)]
method: RPBEPBE
basis: SDD
operation: Freq
keyword: #pfreq=noraman
keyword: PBEPBE/SDD
title: #p freq=noraman PBEPBE/SDD
converged: YES YES NO NO
title: Mulliken charges:
elementType: O O C C C C C C C C C C C C C H H H H H H H H H H H H H H H H H H H H H H H H
charge: -0.288992 -0.250735 -0.063018 0.019578 -0.422311 -0.446330 -0.397170 -0.400343 -0.752081 -0.140927 0.223664 -0.391290 -0.391946 -0.698855 -0.701156 0.210445 0.228234 0.201408 0.192122 0.228266 0.203721 0.191856 0.201159 0.200045 0.206252 0.243974 0.212414 0.204199 0.222607 0.200509 0.222010 0.222300 0.202675 0.215302 0.210847 0.227174 0.208502 0.230538 0.215355
chargesum: 0.00000
title: Mulliken charges with hydrogens summed into heavy atoms:
elementType: O O C C C C C C C C C C C C C
charge: -0.288992 -0.250735 0.147426 0.247812 -0.028781 -0.014343 -0.004155 0.005954 -0.091495 0.081680 0.223664 0.031228 0.033029 -0.045532 -0.046761
polarizability: 1.70842193e+02 1.32969023e+00 1.43373372e+02 1.31009935e+00 -1.36572908e+00 1.19731738e+02
1716.lowfreq: -13.2476 0.0006 0.0009 0.0009 3.3033 12.1008 23.9733 34.2370 54.3776
frequency: 22.7010 34.1342 54.3037 70.9059 85.2686 96.2419 128.8082 143.7968 168.9678 181.7298 201.1589 216.8591 237.2109 255.3250 280.8701 311.8794 317.0560 358.8177 374.6299 392.9881 409.9282 427.7065 451.8147 517.3981 559.9720 630.0890 702.9563 762.9447 777.2310 793.0853 822.7903 830.5732 852.3079 867.4868 885.0093 904.3178 922.7240 925.8847 967.7577 977.3777 991.1354 1018.5409 1048.5772 1055.7711 1060.8378 1072.3984 1095.8731 1098.8821 1102.2126 1112.1283 1118.4717 1154.2989 1156.6848 1162.3621 1217.9323 1244.7189 1245.6638 1245.7534 1258.1457 1274.7722 1287.4360 1296.1517 1307.4767 1326.2479 1327.7380 1331.5868 1334.4142 1337.8064 1346.8021 1357.7675 1366.6386 1385.0174 1395.1174 1395.9074 1460.0221 1462.3657 1465.4561 1468.2661 1469.4539 1472.9421 1477.2119 1478.1821 1478.8968 1480.9067 1483.2512 1487.1800 1625.0124 2959.7475 2969.9124 2970.8087 2973.7531 2973.9865 2975.6952 2976.7368 2981.6753 2984.7406 2985.9452 3002.9743 3013.9439 3027.7536 3034.1252 3034.6564 3042.5525 3045.0049 3057.6947 3064.0626 3073.2441 3074.5432 3075.0803 3076.4711 3087.4792
redmass: 3.1805 4.0662 4.8687 3.0762 2.1528 2.2451 3.0331 2.8312 2.0936 2.0152 1.0724 1.5072 2.7218 1.2676 2.6147 1.7694 2.8028 2.5708 3.1405 3.4846 3.0454 3.2045 3.1120 2.4696 2.4341 2.6488 3.9202 2.3312 1.2935 1.9174 1.9606 1.7759 1.6326 1.9944 2.1040 1.6791 2.2461 2.1630 2.5367 1.3614 1.6304 1.7103 1.4819 1.3192 3.1113 1.8472 1.7141 2.4883 2.1764 2.6398 2.3583 2.4318 2.3281 1.9090 1.4470 1.2853 1.3336 1.3296 1.2893 1.1597 1.3160 1.2198 1.2513 1.3999 1.4464 1.3864 1.4243 1.4149 1.4970 1.5955 1.5696 1.2285 1.2112 1.2178 1.0762 1.0822 1.0876 1.0764 1.0721 1.0657 1.0813 1.0543 1.0541 1.0531 1.0504 1.0521 9.0409 1.0672 1.0722 1.0627 1.0624 1.0429 1.0357 1.0357 1.0602 1.0638 1.0602 1.0825 1.0861 1.0975 1.0978 1.1013 1.1011 1.0990 1.1024 1.0984 1.1011 1.0994 1.0994 1.1005 1.0985
irintensity: 0.0518 1.2795 0.3332 0.4691 0.0170 0.7571 0.7566 0.0966 0.6494 1.1297 0.1038 4.2303 1.8987 0.0838 3.0692 0.3284 2.7527 1.4039 5.2479 2.1135 0.6945 1.4206 1.7514 0.6927 0.7757 0.0136 3.6241 3.3229 0.9655 13.0129 0.8258 8.1492 8.5179 0.4073 5.5707 2.2422 41.2846 5.1125 98.7266 14.4990 7.1599 1.4725 10.3153 1.8916 3.9942 13.4601 9.6167 19.3413 148.0118 2.2734 125.2057 50.4124 10.5372 2.4882 0.5956 0.3893 2.0138 1.4197 23.2786 0.4780 0.4647 0.1988 2.4049 1.9175 1.6762 8.2619 4.2087 0.0794 3.9595 8.3547 19.5983 10.0631 16.6825 9.2182 0.7753 6.7066 10.2298 14.6723 2.3123 25.7436 8.2411 0.9665 33.9640 13.7181 12.5443 3.8783 127.6959 16.0498 11.2282 37.3516 26.4064 40.3990 46.3857 20.2006 1.3276 8.2568 67.0599 37.7110 7.7220 46.8033 56.7157 0.1347 53.9215 7.3062 28.3426 67.3856 11.4039 51.7143 73.9619 104.3080 27.9414
temp: 298.150 k
press: 1.00000 atm
elementType: 8 8 6 6 6 6 6 6 6 6 6 6 6 6 6 1 1 1 1 1 1 1 1 1 1 1 1 1 1 1 1 1 1 1 1 1 1 1 1
symmnumber: 1
zpe: 910513.7 jmol-1
zpe.correction: 0.346796 hartree
zpe.thermalcorrener: 0.364345 hartree
zpe.thermalcorrenthalpy: 0.365289 hartree
zpe.thermalcorrgfe: 0.300546 hartree
zpe.sumelectzpe: -659.028475 hartree
zpe.sumelectthermal: -659.010927 hartree
zpe.sumelectthermalent: -659.009982 hartree
zpe.sumelectthermalfe: -659.074725 hartree
dipole: -0.8070 0.2810 -1.6263
dipole: 1.8371
quadrupole: -85.2258 -92.8601 -98.6383
quadrupole: 0.9341 -3.1341 1.5177
quadrupole: 7.0156 -0.6187 -6.3969 0.9341 -3.1341 1.5177
hfenergy: -659.3752717 hartree
pointgroup: C01[X(C13H24O2)]
dipole: 0.3354864 -0.1264219 -0.6275877 debye
polarizability: 170.8831719|1.2054283|143.4183344|0.1437081|0.8443742|119.6457964 unknown
InChI: InChI=1S/C13H24O2/c1-4-11(5-2)13(14)15-12-9-7-6-8-10(12)3/h10-12H,4-9H2,1-3H3
charge 0 multiplicity 1
39 atoms
O  -0.156448 -0.095961 -0.438136
O  -1.180736 0.47445 1.581252
C  2.122989 -0.982078 -0.534206
C  1.20167 0.010341 0.202507
C  3.568651 -0.826427 0.01442
C  1.684512 1.469004 0.10527
C  4.08461 0.628793 -0.07674
C  3.126843 1.600954 0.651263
C  1.624296 -2.436954 -0.40644
C  -2.571711 0.005248 -0.406671
C  -1.26677 0.162904 0.368014
C  -3.366364 1.341808 -0.376753
C  -3.404879 -1.154694 0.212013
C  -2.645864 2.511204 -1.08061
C  -2.718349 -2.534032 0.120752
H  2.126776 -0.697342 -1.607791
H  1.090893 -0.277905 1.267601
H  4.238951 -1.509652 -0.542562
H  3.589134 -1.158025 1.074326
H  0.993521 2.122981 0.668084
H  1.656218 1.782279 -0.95737
H  4.164089 0.924287 -1.143312
H  5.102232 0.699123 0.353426
H  3.131693 1.377073 1.737911
H  3.473222 2.645841 0.539262
H  0.606815 -2.546631 -0.819551
H  2.29416 -3.129524 -0.949031
H  1.601006 -2.752815 0.654908
H  -2.315144 -0.247355 -1.45293
H  -4.347024 1.163778 -0.860535
H  -3.568692 1.604416 0.679724
H  -3.616428 -0.90752 1.27046
H  -4.37933 -1.188318 -0.314095
H  -3.266834 3.425308 -1.060995
H  -2.428629 2.269636 -2.137958
H  -1.686358 2.74917 -0.585217
H  -2.491556 -2.79887 -0.929166
H  -1.767853 -2.549328 0.685517
H  -3.367311 -3.324965 0.538762
