program: Gaussian 09
title: 000228648
version: EM64L-G09RevD.01
frameworkgroup: C1[X(C17H17ClO3)]
method: RPBEPBE
basis: SDD
operation: Freq
keyword: #p
keyword: freq=noraman
keyword: PBEPBE/SDD
title: #p freq=noraman PBEPBE/SDD
converged: YES YES NO NO
title: Mulliken charges:
elementType: Cl O O O C C C C C C C C C C C C C C C C C H H H H H H H H H H H H H H H H H
charge: -0.037922 -0.249185 -0.253897 -0.255434 -0.036441 -0.303535 -0.706262 -0.657821 0.444315 0.287518 0.509013 -0.365000 -0.405012 -0.322081 -0.331831 -0.220240 -0.221968 -0.241342 -0.208326 -0.233006 -0.243095 0.234867 0.215862 0.263720 0.232111 0.205262 0.266775 0.241528 0.242712 0.254316 0.236118 0.256773 0.226632 0.226891 0.228982 0.254880 0.229838 0.234286
chargesum: 0.00000
title: Mulliken charges with hydrogens summed into heavy atoms:
elementType: Cl O O O C C C C C C C C C C C C C C C C C
charge: -0.037922 -0.249185 -0.253897 -0.255434 0.198426 0.176048 -0.002114 -0.173581 0.444315 0.287518 0.509013 -0.110684 -0.168894 -0.322081 -0.075059 0.006392 0.004922 -0.012360 0.046554 -0.003168 -0.008808
polarizability: 2.58660003e+02 -1.28772002e+01 2.08455980e+02 -2.83782493e+01 -1.82005523e+00 1.24454692e+02
1716.lowfreq: -4.9328 -3.0937 -0.0005 0.0008 0.0013 4.0827 11.2001 17.2153 21.6509
frequency: 10.6051 17.1755 21.4631 27.8647 35.0034 75.1334 81.8507 102.0048 148.6473 154.2607 172.8181 193.2919 205.2619 223.8815 240.0611 261.1928 292.7643 325.5131 374.9179 399.8103 403.8864 418.2482 441.4371 464.4709 468.1053 513.4895 540.5337 545.9074 600.9675 617.8903 627.8721 684.0346 697.5394 710.0675 713.1058 751.3167 760.4849 770.2034 806.1504 826.7185 839.9336 853.9485 878.5220 919.9553 924.7647 929.9060 941.9816 944.4817 968.9270 970.3232 978.0128 989.9379 996.5888 1021.6922 1027.7826 1042.3791 1062.5615 1076.0611 1096.2546 1114.8189 1132.8463 1164.6884 1172.7566 1173.0582 1189.7642 1201.9085 1223.8881 1231.7379 1239.1314 1268.0625 1284.3991 1324.4230 1332.8471 1342.2734 1367.7962 1383.5343 1383.9585 1399.8468 1428.5276 1441.0091 1454.1961 1460.2755 1464.5950 1476.1329 1482.0701 1483.9136 1574.9622 1595.1446 1605.0233 1609.8524 1626.6287 2963.9616 3002.6234 3020.9624 3022.7868 3043.2920 3097.0214 3101.0807 3122.0578 3124.3324 3127.4626 3139.1236 3139.2436 3149.3260 3154.7943 3164.5602 3166.8277 3177.9438
redmass: 5.1430 6.6714 5.2175 4.6667 5.7037 5.8956 7.1253 6.1921 4.4636 3.8430 2.9541 4.2627 1.4831 3.2190 4.8290 5.3442 4.9838 2.3289 6.4048 3.9878 2.8387 2.5610 3.2324 5.2180 3.4444 5.3065 3.8857 5.5685 4.5766 5.9808 4.8315 5.5732 3.4465 3.2881 1.9702 1.2889 2.3948 3.9814 4.3543 3.7982 1.4167 1.2480 3.4399 1.8111 1.4136 2.7523 1.6802 2.1404 1.9476 1.5398 1.3947 5.7998 1.3315 7.4234 2.2383 2.0164 1.9012 1.7626 1.7668 1.5711 1.5580 2.0646 1.0539 1.0755 1.1369 2.6357 1.5079 1.2590 2.5389 1.5654 1.5063 1.5796 1.3669 1.4086 1.6414 3.3830 6.8716 1.2645 2.3372 2.0947 1.1306 1.2553 1.2787 1.1878 1.2611 2.2067 6.2764 6.2034 7.1690 6.3435 9.1750 1.0599 1.0378 1.0842 1.0610 1.1024 1.0982 1.1014 1.0850 1.1011 1.0877 1.0923 1.0857 1.0966 1.0899 1.1017 1.0941 1.1004
irintensity: 0.0556 0.1285 0.7404 0.6183 1.1300 0.9460 0.9788 2.0743 0.6484 4.0293 4.4914 3.1818 1.1137 2.1442 3.0557 0.1435 7.1526 1.1744 4.3519 3.3310 0.1002 2.2584 6.7100 2.2473 3.8560 12.5252 0.3494 2.4675 11.9269 1.7516 2.3972 23.0421 8.9791 8.0808 57.6121 89.9287 49.1813 12.4826 10.1090 5.5202 0.7755 0.3113 12.6610 29.4427 0.9920 28.9903 10.1712 62.1691 36.0481 18.2681 0.2905 1.7078 0.0942 54.3220 10.5733 31.7798 63.4303 63.3853 151.4973 53.9068 6.7817 4.8618 0.8413 3.8075 3.1658 0.6644 282.0929 31.7844 93.5439 57.7268 70.6880 1.1301 18.0428 6.9062 1.3973 15.9785 3.0831 28.7098 19.1043 8.1892 18.6501 95.4636 66.2655 31.1962 2.8064 19.7265 11.6779 4.6385 48.7283 31.6549 117.0673 25.7602 14.9292 16.5124 12.1314 19.9315 29.2119 4.4979 3.3229 13.2186 0.4097 19.8701 2.5848 33.4309 12.2486 20.7734 14.5754 10.2466
temp: 298.150 k
press: 1.00000 atm
elementType: 17 8 8 8 6 6 6 6 6 6 6 6 6 6 6 6 6 6 6 6 6 1 1 1 1 1 1 1 1 1 1 1 1 1 1 1 1 1
symmnumber: 1
zpe: 780811.2 jmol-1
zpe.correction: 0.297395 hartree
zpe.thermalcorrener: 0.317383 hartree
zpe.thermalcorrenthalpy: 0.318327 hartree
zpe.thermalcorrgfe: 0.243813 hartree
zpe.sumelectzpe: -1342.209325 hartree
zpe.sumelectthermal: -1342.189337 hartree
zpe.sumelectthermalent: -1342.188393 hartree
zpe.sumelectthermalfe: -1342.262907 hartree
dipole: 0.1768 -1.2706 0.9082
dipole: 1.5718
quadrupole: -114.5767 -127.7592 -126.6527
quadrupole: -12.0924 -3.3003 -0.7354
quadrupole: 8.4195 -4.7630 -3.6565 -12.0924 -3.3003 -0.7354
hfenergy: -1342.5067201 hartree
pointgroup: C01 [X(C17H17Cl1O3)]
dipole: -0.0836884 -0.0598453 -0.6097717 debye
polarizability: 245.6133253|45.6550457|169.4652053|-17.4633005|37.5782144|176.4921447 unknown
InChI: InChI=1S/C17H17ClO3/c1-13(12-20-16-10-6-5-9-15(16)18)21-17(19)11-14-7-3-2-4-8-14/h2-10,13H,11-12H2,1H3
charge 0 multiplicity 1
38 atoms
Cl -4.069739 0.712928 2.377487
O  0.457551 0.74511 -0.01268
O  -2.507233 0.295205 -0.098951
O  1.363839 -0.758073 -1.551503
C  -0.490432 1.250375 -1.065548
C  -1.631937 0.249038 -1.277597
C  -0.940695 2.631726 -0.592416
C  2.308791 -0.597695 0.731261
C  3.670846 0.070858 0.528115
C  1.3526 -0.251115 -0.403506
C  -3.613025 -0.552989 -0.07827
C  4.519457 -0.336629 -0.533178
C  4.097308 1.110468 1.390694
C  -4.463756 -0.472281 1.056446
C  -3.940405 -1.47864 -1.102632
C  5.775158 0.28147 -0.721977
C  5.355137 1.728986 1.202798
C  6.198328 1.315302 0.146395
C  -5.602381 -1.284965 1.178347
C  -5.085259 -2.297999 -0.983254
C  -5.91856 -2.207311 0.151859
H  0.075997 1.29939 -2.015903
H  -2.205654 0.541412 -2.182161
H  -1.224699 -0.768972 -1.423049
H  -0.06724 3.291734 -0.46212
H  -1.61577 3.086439 -1.340017
H  -1.483146 2.551688 0.362368
H  2.424293 -1.696374 0.736285
H  1.861268 -0.281768 1.686511
H  4.188252 -1.129076 -1.214367
H  3.444513 1.436629 2.209183
H  -3.306433 -1.565687 -1.989627
H  6.423019 -0.042896 -1.544181
H  5.674534 2.529762 1.879277
H  7.173936 1.792574 0.000922
H  -6.233992 -1.194927 2.067138
H  -5.321055 -3.007856 -1.783175
H  -6.805516 -2.841241 0.246123
