program: Gaussian 09
title: 000228637
version: EM64L-G09RevD.01
frameworkgroup: C1[X(C13H8Cl4O4S2)]
method: RPBEPBE
basis: SDD
operation: Freq
keyword: #p
keyword: freq=noraman
keyword: PBEPBE/SDD
title: #p freq=noraman PBEPBE/SDD
converged: YES YES NO NO
title: Mulliken charges:
elementType: Cl Cl Cl Cl S S O O O O C C C C C C C C C C C C C H H H H H H H H
charge: 0.168531 0.168384 -0.018772 -0.018885 0.952082 0.951726 -0.527664 -0.498276 -0.498481 -0.527064 -0.550117 -0.075137 -0.074655 -0.243284 -0.243569 -0.188894 -0.190050 -0.182296 -0.182354 -0.193770 -0.193985 -0.100631 -0.100476 0.302395 0.302529 0.334025 0.335247 0.272632 0.272622 0.274098 0.274088
chargesum: 0.00000
title: Mulliken charges with hydrogens summed into heavy atoms:
elementType: Cl Cl Cl Cl S S O O O O C C C C C C C C C C C C C
charge: 0.168531 0.168384 -0.018772 -0.018885 0.952082 0.951726 -0.527664 -0.498276 -0.498481 -0.527064 -0.550117 -0.075137 -0.074655 0.059112 0.058960 0.145131 0.145197 0.090336 0.090268 0.080328 0.080102 -0.100631 -0.100476
polarizability: 4.17125876e+02 9.85957370e-02 1.93802990e+02 -1.13061664e+01 -3.34790634e-02 1.95173089e+02
1716.lowfreq: -2.2692 0.0022 0.0023 0.0031 1.4339 5.3717 20.6370 25.1738 37.2832
frequency: 20.6279 25.1618 37.2760 40.9812 56.7551 59.1507 96.8121 101.7025 108.8177 110.5352 121.2506 131.7190 140.3562 157.0696 167.7998 188.6806 205.3203 212.9616 214.0399 254.5217 256.4767 282.6785 283.7941 313.0630 351.9889 371.3875 380.2187 381.2405 387.3022 410.6729 411.4709 414.9359 484.6228 487.9506 494.2213 508.3479 556.1032 609.7558 609.8755 667.8052 694.9819 695.0312 699.4012 700.0021 743.8788 809.9785 812.7117 825.5383 828.0480 835.3181 836.3683 933.6632 947.6577 959.2081 961.1359 972.8980 973.2984 976.4568 977.2294 1039.9299 1040.6653 1067.6721 1067.9412 1110.9935 1112.2039 1182.9828 1184.7649 1289.7594 1290.2072 1381.5689 1381.7050 1383.5882 1383.6800 1449.8969 1450.8676 1563.0382 1563.1508 1588.8357 1589.0202 3151.0511 3152.9083 3161.4347 3161.4722 3179.9823 3180.0787 3182.2081 3182.3481
redmass: 18.0242 8.3464 20.9555 5.4998 6.8593 5.9805 11.2966 11.2843 16.2849 10.6715 12.6738 16.2495 17.2399 18.4382 16.9088 15.1298 19.1852 13.9301 15.3697 11.3943 9.9658 9.1291 7.9407 14.2947 5.5592 7.2044 10.7404 15.7356 16.5407 2.9667 2.9626 10.1126 5.7122 11.2043 3.6105 5.2643 10.8847 7.1437 7.1347 12.7858 4.6061 4.7316 5.6469 6.1952 12.8512 17.1360 11.0953 1.2799 1.2860 1.3937 1.4411 15.3096 9.6372 1.3818 1.4829 2.2926 2.8212 1.9210 2.1441 2.8467 2.8058 2.9983 3.0478 1.3370 1.3433 1.1413 1.1411 1.2387 1.2400 6.1453 6.4852 3.5268 3.4686 2.0300 2.0239 5.9381 5.9450 8.1215 8.1141 1.0923 1.0921 1.0896 1.0896 1.0958 1.0959 1.0970 1.0971
irintensity: 0.2882 0.4985 0.1456 0.2097 0.0475 0.2333 2.3144 3.4949 1.7969 8.5319 1.1839 0.4195 2.7064 0.8707 0.0546 0.0099 1.2369 17.9939 0.8360 0.0677 0.0246 13.9415 3.0588 0.1202 0.3897 0.3779 65.3761 1.9178 175.0716 0.8307 6.4840 19.9430 4.3799 51.9942 46.5056 83.1122 23.1064 0.7853 1.3732 52.1262 7.7583 15.0215 72.5510 6.9194 64.7298 139.2307 7.1991 15.2351 4.6908 47.0978 71.2639 57.4881 55.0333 0.8064 2.1062 4.7751 35.1652 27.1931 3.7751 94.0623 6.8076 123.2863 9.7258 5.5902 5.5497 42.1209 3.2519 1.1780 2.5702 16.7659 14.3632 8.6225 5.8008 138.4297 15.6685 9.3102 81.8038 5.9469 1.5661 32.2544 32.6255 4.7131 4.5654 0.3275 0.4695 10.5937 3.5371
temp: 298.150 k
press: 1.00000 atm
elementType: 17 17 17 17 16 16 8 8 8 8 6 6 6 6 6 6 6 6 6 6 6 6 6 1 1 1 1 1 1 1 1
symmnumber: 1
zpe: 471162.5 jmol-1
zpe.correction: 0.179456 hartree
zpe.thermalcorrener: 0.203774 hartree
zpe.thermalcorrenthalpy: 0.204718 hartree
zpe.thermalcorrgfe: 0.122533 hartree
zpe.sumelectzpe: -3435.419870 hartree
zpe.sumelectthermal: -3435.395552 hartree
zpe.sumelectthermalent: -3435.394608 hartree
zpe.sumelectthermalfe: -3435.476793 hartree
dipole: 0.0063 0.2385 0.0043
dipole: 0.2387
quadrupole: -156.9075 -175.0032 -191.9314
quadrupole: -0.0041 4.8130 0.0465
quadrupole: 17.7065 -0.3891 -17.3174 -0.0041 4.8130 0.0465
hfenergy: -3435.5993266 hartree
pointgroup: C01 [X(C13H8Cl4O4S2)]
dipole: 0.0004356 0.0039314 -0.0938147 debye
polarizability: 415.2091236|-22.7400971|196.9409043|-5.7049914|0.6350099|193.9519277 unknown
InChI: InChI=1S/C13H8Cl4O4S2/c14-9-1-5-11(6-2-9)22(18,19)13(16,17)23(20,21)12-7-3-10(15)4-8-12/h1-8H
charge 0 multiplicity 1
31 atoms
Cl -1.225187 1.172773 -2.614177
Cl 1.159518 -0.713375 -2.715031
Cl 6.812785 -0.930491 0.996821
Cl -6.711102 1.178591 1.361388
S  1.046928 1.56149 -0.448707
S  -1.019484 -1.221894 -0.481124
O  0.152328 1.73188 0.899947
O  1.335557 2.843451 -1.409824
O  -1.353966 -2.449499 -1.496846
O  -0.064064 -1.46522 0.813393
C  -0.012505 0.202516 -1.671683
C  2.711355 0.765058 -0.050285
C  -2.663311 -0.449737 0.034973
C  3.829969 1.29272 -0.718353
C  -3.812714 -0.949426 -0.601636
C  2.770025 -0.252081 0.916788
C  -2.675994 0.521113 1.050198
C  5.0983 0.766684 -0.389663
C  -5.064164 -0.44441 -0.186495
C  4.044141 -0.772241 1.236272
C  -3.9336 1.021034 1.455795
C  5.181147 -0.255882 0.579315
C  -5.10082 0.531134 0.832506
H  3.716204 2.097123 -1.451653
H  -3.7340 -1.717405 -1.377351
H  1.862594 -0.643653 1.387161
H  -1.747136 0.894816 1.492675
H  6.000163 1.146146 -0.877246
H  -5.98837 -0.803805 -0.646697
H  4.143764 -1.568997 1.978042
H  -3.997661 1.782286 2.237696
