program: Gaussian 09
title: 000228631
version: EM64L-G09RevD.01
frameworkgroup: C1[X(C12H17N5O2)]
method: RPBEPBE
basis: SDD
operation: Freq
keyword: #p
keyword: freq=noraman
keyword: PBEPBE/SDD
title: #p freq=noraman PBEPBE/SDD
converged: YES YES NO NO
title: Mulliken charges:
elementType: O O N N N N N C C C C C C C C C C C C H H H H H H H H H H H H H H H H H
charge: -0.305203 -0.278474 -0.150352 -0.223562 -0.117025 -0.164312 -0.219393 -0.358197 -0.359280 -0.453718 -0.458479 0.212108 0.140617 0.101851 0.156565 -0.648943 0.200359 -0.617982 -0.603606 0.232868 0.248377 0.225007 0.231867 0.232466 0.225519 0.234326 0.227729 0.232159 0.306844 0.233152 0.270975 0.242612 0.242493 0.267978 0.245938 0.246713
chargesum: 0.00000
title: Mulliken charges with hydrogens summed into heavy atoms:
elementType: O O N N N N N C C C C C C C C C C C C
charge: -0.305203 -0.278474 -0.150352 -0.223562 -0.117025 -0.164312 -0.219393 0.123049 0.097595 0.004268 0.003576 0.212108 0.140617 0.101851 0.156565 0.123212 0.200359 0.138098 0.157023
polarizability: 2.60105223e+02 3.56209471e+00 1.80390920e+02 -1.41679032e+00 -3.78081524e-01 9.82998164e+01
1716.lowfreq: -9.4888 -3.9789 0.0009 0.0011 0.0011 3.3633 39.4475 55.8921 81.9462
frequency: 39.3523 55.8766 81.9422 87.6504 101.0477 111.4009 117.1261 121.3927 127.3649 165.4865 182.8446 221.6163 237.7023 245.8499 253.0526 271.0161 289.3386 320.5147 326.6409 362.8972 378.6433 389.8257 437.0627 464.3909 513.3146 570.4422 580.7050 639.8212 668.7411 694.4102 701.3132 717.4502 729.6603 746.8532 779.4067 854.4757 866.5876 908.0956 914.2474 928.6776 957.7324 974.1368 999.0215 1033.6302 1051.0387 1071.1654 1119.1667 1125.0063 1129.1358 1131.9650 1136.7511 1163.2984 1171.0949 1187.5493 1201.3134 1221.5150 1227.6386 1233.0478 1240.2726 1265.5566 1300.0448 1304.5724 1313.2881 1321.2632 1343.1180 1350.9387 1391.6526 1410.6506 1426.3736 1456.3500 1468.3733 1470.2283 1473.6199 1474.0428 1478.1956 1479.1797 1481.6880 1490.7069 1496.5764 1499.5359 1504.3856 1546.7090 1592.1820 1623.1213 1647.9307 2973.1722 2981.2489 2988.8659 3004.8027 3008.7629 3010.7034 3013.5083 3031.8760 3067.6802 3080.8583 3082.9426 3092.8828 3094.8201 3099.4659 3102.0495 3135.0663 3136.1131
redmass: 3.4608 3.0241 3.6284 3.2223 1.0816 4.0501 1.2971 2.5031 2.5564 1.3914 2.4460 4.7654 3.2251 2.2152 4.4353 3.2324 3.2152 3.9795 4.6956 4.0093 7.6803 9.1804 7.7398 7.4409 5.9329 1.8834 6.4053 10.6044 5.9219 11.1017 11.4648 5.7000 10.8883 2.9543 4.9791 1.6732 1.8961 4.1448 2.3314 1.4427 5.2078 1.7586 3.1166 2.4766 3.1261 1.7326 1.6902 1.2977 1.3017 1.2989 2.8182 1.5807 1.5209 3.0891 2.9436 1.7853 2.2242 2.3324 1.3849 6.4755 5.7978 1.3555 1.2501 2.2480 1.5070 2.5227 2.5931 1.2922 1.2556 1.9573 1.0947 1.3148 1.0451 1.0931 1.0686 1.0431 1.1403 1.0939 1.1049 1.8242 1.1380 6.7114 7.6637 11.0300 9.7129 1.0548 1.0662 1.0379 1.0335 1.0328 1.0694 1.0630 1.1000 1.0971 1.1011 1.1016 1.1023 1.1055 1.1021 1.1023 1.1022 1.1011
irintensity: 0.5726 0.3662 1.1589 0.3180 0.4013 0.3123 1.6633 1.5780 11.9867 0.4679 10.6568 4.5372 13.1624 2.2870 0.3682 2.3040 0.1616 2.5137 6.8078 10.0098 1.5298 25.3708 3.5647 12.9135 22.9969 2.2682 1.6470 5.5866 3.0414 1.2027 5.3117 7.5882 20.5324 2.1565 2.6937 5.9570 2.5981 15.2212 14.6208 5.5049 47.9805 6.2544 62.4930 57.2804 10.2657 4.7583 1.1427 0.2914 0.2808 0.2057 7.2037 2.5408 23.0736 36.3552 2.8971 25.2603 8.7691 58.9888 5.4810 46.8992 17.8854 8.2110 0.4926 36.3895 25.4924 43.3085 12.5452 3.7636 44.6163 326.2953 13.4454 47.6182 17.1549 41.4077 1.1067 18.0129 17.1638 23.4347 62.7249 187.5003 24.4966 416.8912 622.6947 281.1419 490.9797 24.9873 34.9439 88.4562 38.2680 38.8872 26.7673 29.4401 27.3516 20.5694 38.5482 20.8192 19.1819 57.4725 20.6304 3.5735 0.8128 0.5871
temp: 298.150 k
press: 1.00000 atm
elementType: 8 8 7 7 7 7 7 6 6 6 6 6 6 6 6 6 6 6 6 1 1 1 1 1 1 1 1 1 1 1 1 1 1 1 1 1
symmnumber: 1
zpe: 766171.2 jmol-1
zpe.correction: 0.291819 hartree
zpe.thermalcorrener: 0.310142 hartree
zpe.thermalcorrenthalpy: 0.311086 hartree
zpe.thermalcorrgfe: 0.245409 hartree
zpe.sumelectzpe: -890.299272 hartree
zpe.sumelectthermal: -890.280949 hartree
zpe.sumelectthermalent: -890.280005 hartree
zpe.sumelectthermalfe: -890.345682 hartree
dipole: 7.7140 -0.1641 -0.0142
dipole: 7.7157
quadrupole: -106.6420 -115.3484 -110.8537
quadrupole: -0.8537 1.3451 0.1292
quadrupole: 4.3060 -4.4003 0.0943 -0.8537 1.3451 0.1292
hfenergy: -890.5910911 hartree
pointgroup: C01 [X(C12H17N5O2)]
dipole: -3.0227869 -0.0060726 0.2785656 debye
polarizability: 258.9491922|-7.9217785|165.6163391|-12.1053564|-31.1248089|114.2304286 unknown
InChI: InChI=1S/C12H17N5O2/c1-14-8-9(13-11(14)17-6-4-5-7-17)15(2)12(19)16(3)10(8)18/h4-7H2,1-3H3
charge 0 multiplicity 1
36 atoms
O  2.150979 -2.476141 0.950761
O  4.064345 1.293426 -1.15017
N  -2.771211 0.114656 0.300436
N  -0.598544 -1.014036 0.564869
N  -0.686295 1.050804 -0.456355
N  1.733814 1.287821 -0.862591
N  3.082776 -0.56163 -0.104126
C  -3.468429 1.385686 -0.040898
C  -3.707213 -1.045486 0.32546
C  -4.942861 1.059325 0.270164
C  -5.060239 -0.435065 -0.12669
C  -1.41074 0.039053 0.133575
C  0.728796 -0.649573 0.220127
C  0.621484 0.610685 -0.38636
C  1.971178 -1.334804 0.406714
C  -0.939184 -2.151291 1.438982
C  3.021062 0.710296 -0.731367
C  1.587833 2.605119 -1.508488
C  4.438602 -1.140945 0.024284
H  -3.316342 1.637778 -1.109433
H  -3.058398 2.216496 0.557147
H  -3.785561 -1.472908 1.343459
H  -3.367697 -1.844297 -0.360715
H  -5.637943 1.705573 -0.291198
H  -5.14444 1.188623 1.349231
H  -5.9188 -0.942216 0.34426
H  -5.168153 -0.52499 -1.223031
H  -1.634802 -2.849772 0.945644
H  -0.002265 -2.688281 1.657629
H  -1.387969 -1.792343 2.382721
H  2.59387 2.949295 -1.789191
H  1.119689 3.319117 -0.810204
H  0.949477 2.520048 -2.404145
H  4.328767 -2.119396 0.514595
H  5.080566 -0.475741 0.62509
H  4.897848 -1.255281 -0.971385
