program: Gaussian 09
title: 000228613
version: EM64L-G09RevD.01
frameworkgroup: C1[X(C12H7N3O3)]
method: RPBEPBE
basis: SDD
operation: Freq
keyword: #p
keyword: freq=noraman
keyword: PBEPBE/SDD
title: #p freq=noraman PBEPBE/SDD
converged: NO NO NO NO
title: Mulliken charges:
elementType: O O O N N N C C C C C C C C C C C C H H H H H H H
charge: -0.268584 -0.203195 -0.196572 -0.106431 0.004693 0.020149 0.325601 0.270772 -0.011105 0.045543 -0.526054 -0.285770 0.433171 -0.366804 -0.370181 -0.323271 -0.207450 -0.212652 0.346490 0.275284 0.301346 0.294975 0.271209 0.245169 0.243664
chargesum: 0.00000
title: Mulliken charges with hydrogens summed into heavy atoms:
elementType: O O O N N N C C C C C C C C C C C C
charge: -0.268584 -0.203195 -0.196572 -0.106431 0.004693 0.020149 0.325601 0.270772 -0.011105 0.045543 -0.179563 -0.010487 0.433171 -0.065457 -0.075206 -0.052061 0.037719 0.031012
polarizability: 3.45444285e+02 -9.88735472e+00 1.80939268e+02 -3.17998988e-02 8.00710014e-03 5.82196048e+01
1716.lowfreq: -7.8020 -6.7408 0.0003 0.0004 0.0006 7.2992 50.9569 57.6834 106.4670
frequency: 50.9520 57.5704 106.4668 140.6765 161.1276 169.6199 255.2764 268.1288 295.5384 336.5447 343.0462 411.5677 438.4574 474.2785 479.0102 513.5105 515.0932 536.3661 568.0921 602.1643 616.1335 638.2824 656.2068 700.9329 706.4593 740.4265 772.6534 778.3831 790.0717 856.2744 857.8296 870.0813 885.7908 958.1233 958.9608 981.9423 1003.0527 1004.3541 1012.0822 1050.2954 1101.5404 1119.6044 1156.4749 1159.6168 1196.0789 1204.2830 1232.5723 1248.4329 1269.8113 1315.9960 1345.5035 1368.4607 1386.4148 1414.0059 1437.0686 1456.0713 1467.8241 1483.3859 1537.5966 1562.4957 1597.7667 1627.2013 3146.0314 3161.5207 3170.9958 3177.4058 3188.7037 3193.2598 3194.9024
redmass: 8.4056 13.4533 4.6557 9.4489 5.8743 6.4618 7.0234 5.2077 9.6024 7.5697 9.6007 3.4427 6.8570 8.2439 3.0914 4.1640 7.6929 9.6300 4.0952 7.1946 7.1799 5.2036 7.1610 7.5040 5.9432 4.0948 9.2974 1.8177 2.2119 1.6146 6.7108 5.8638 1.5100 1.4753 4.8935 1.3464 1.3269 1.3194 2.0297 2.0936 2.2796 1.8184 1.2480 2.3031 3.5587 2.5558 1.8963 2.9186 2.2600 5.4455 2.6834 7.7126 4.0814 4.8093 3.3051 4.9274 3.3227 7.1238 7.0584 8.5823 6.3331 7.1848 1.0871 1.0908 1.0895 1.0970 1.0975 1.0933 1.0960
irintensity: 0.0163 0.0306 4.3532 0.4014 1.0670 4.7541 4.1934 0.8632 0.6794 1.0098 3.4680 3.7981 0.7677 2.3644 0.0326 0.2754 2.3342 0.0306 3.5238 7.7837 2.4338 27.0530 15.2151 5.5683 6.9652 1.7903 17.6885 63.8640 32.3109 37.6209 3.5665 5.7168 0.0505 27.7088 1.0071 4.2644 0.0427 0.2267 9.5906 38.4001 11.8105 20.4146 4.8962 5.1862 381.1492 131.4600 37.8308 1.8549 19.6982 81.1374 18.4740 106.2644 15.7441 10.2156 22.5133 23.5922 39.1325 43.8593 8.5930 11.5757 41.1758 20.2442 6.0627 9.4903 3.1322 8.4152 11.6782 10.4280 10.3142
temp: 298.150 k
press: 1.00000 atm
elementType: 8 8 8 7 7 7 6 6 6 6 6 6 6 6 6 6 6 6 1 1 1 1 1 1 1
symmnumber: 1
zpe: 451487.7 jmol-1
zpe.correction: 0.171963 hartree
zpe.thermalcorrener: 0.184941 hartree
zpe.thermalcorrenthalpy: 0.185885 hartree
zpe.thermalcorrgfe: 0.131934 hartree
zpe.sumelectzpe: -850.055850 hartree
zpe.sumelectthermal: -850.042872 hartree
zpe.sumelectthermalent: -850.041928 hartree
zpe.sumelectthermalfe: -850.095878 hartree
dipole: -6.5458 -2.2863 0.0048
dipole: 6.9336
quadrupole: -105.3621 -104.7485 -103.7076
quadrupole: -8.5243 0.0256 0.0005
quadrupole: -0.7561 -0.1425 0.8985 -8.5243 0.0256 0.0005
hfenergy: -850.2278125 hartree
pointgroup: C01 [X(C12H7N3O3)]
dipole: 2.5748407 0.9008229 0.0018963 debye
dipolederiv: -0.2866088 -0.0934995 0.0000086 0.038544 -0.9567364 0.0000252 0.0000274 0.0004565 -0.2593539 -1.0438633 0.2084128 0.0001294 0.2117067 -0.5467787 -0.0004601 -0.0015884 0.0007277 -0.2265872 -0.7123699 -0.1306945 -0.0002233 -0.4858273 -0.7010134 0.0006189 -0.0012648 -0.0010377 -0.2188558 0.3735968 0.1496359 -0.000025 -0.0744492 1.0077669 -0.0001928 -0.0002604 -0.0006792 0.0902802 -0.8886891 0.1145525 -0.000062 -0.010719 -0.2810893 0.000018 0.0000249 0.0000935 -0.2413447 2.2792849 -0.0102395 0.0006845 0.5060456 1.0313428 0.0000197 0.0019918 0.0001054 0.1804014 -0.3209554 0.1739176 -0.0001445 -0.1403122 -0.2962973 0.0001114 0.0002028 0.0000857 0.0629498 0.0078447 -0.3451338 0.0001198 -0.3162883 -0.2314117 0.0000825 0.0000316 0.000131 0.0716757 0.7065646 -0.0446211 -0.0000036 0.1439242 0.0855593 0.0000375 0.0000815 -0.0000332 0.0893757 0.6482574 -0.1656462 0.000072 0.0626434 0.1194646 -0.0000217 -0.0000797 -0.0000294 0.0962003 0.4476456 -0.0199496 0.0000553 -0.0380908 -0.140278 -0.0000872 0.000659 0.0000998 -0.089999 -0.3615141 0.0508658 -0.0000446 -0.0220529 0.1897054 -0.0000514 0.0001881 -0.0000625 -0.1292525 -1.0217076 0.0689172 -0.0005069 -0.1303376 0.0789615 -0.0001174 -0.0002404 0.000144 0.0634793 -0.1642851 0.1035809 -0.0000256 -0.077702 -0.0312166 -0.0000116 0.0000273 0.0000195 -0.1406481 0.094999 -0.1155946 -0.000068 0.2255483 0.0343794 0.000075 0.0004164 -0.0000205 -0.116807 -0.3392918 0.1294247 -0.0000408 0.1248204 0.1337159 -0.0000246 0.0000231 -0.0000354 -0.1545684 0.0240002 -0.2117004 0.0000444 -0.1186824 0.0453086 -0.0000217 -0.0000029 -0.000055 -0.1366957 0.1787364 0.1038251 0.0000098 0.1009339 0.10399 -0.0000397 0.000017 -0.0000087 -0.1224039 0.1365616 0.0370373 0.0000043 -0.0064349 0.126997 0.0000043 0.0000189 -0.000019 0.1892833 0.081041 -0.0496368 -0.0000138 0.0062411 -0.0036848 0.000002 -0.0001709 0.0000276 0.1556758 0.1167371 -0.0645533 0.0000072 0.0217116 0.0467133 0.0000073 -0.0000207 0.0000248 0.1808539 0.0836787 0.0724317 0.0000472 0.0044552 0.1069468 -0.0000149 -0.0000637 0.0000299 0.1748734 0.0902712 0.022535 -0.0000038 -0.0487999 -0.0195693 0.0000167 0.0000141 0.0000052 0.1621242 -0.0396404 0.0868492 -0.000016 0.0949327 0.0244564 0.0000199 -0.0000115 0.0000193 0.1598126 -0.0902936 -0.0707164 -0.0000046 -0.0718106 0.0727674 0.0000048 -0.0000205 0.0000104 0.1595305 unknown
polarizability: 345.45436|-9.8031795|180.9291927|0.031804|-0.0079908|58.2196048 unknown
InChI: InChI=1S/C12H7N3O3/c16-14-11-4-2-1-3-9(11)13-10-6-5-8(15(17)18)7-12(10)14/h1-7H
charge 0 multiplicity 1
25 atoms
O  0.537334 -2.451307 0.000733
O  -5.106154 0.440788 -0.00204
O  -4.299853 -1.697851 -0.0016
N  0.724045 -1.146316 0.000055
N  1.127673 1.72672 -0.000066
N  -4.138874 -0.416833 0.000781
C  -0.375848 -0.257944 0.000216
C  2.026835 -0.600857 0.000136
C  -0.124388 1.173369 0.000103
C  2.18154 0.841184 0.000006
C  -1.690156 -0.787685 0.000472
C  -1.271555 2.043146 0.000241
C  -2.751259 0.1165 0.000573
C  3.149663 -1.473718 0.000327
C  -2.564295 1.53612 0.000439
C  3.520575 1.359612 0.000023
C  4.4332 -0.923225 0.000318
C  4.618063 0.500093 0.00016
H  -1.85444 -1.867405 0.000544
H  -1.074976 3.118804 0.00018
H  2.974121 -2.551993 0.000419
H  -3.443308 2.184681 0.000546
H  3.63226 2.447668 -0.000064
H  5.307806 -1.581679 0.000421
H  5.633089 0.910528 0.000176
