program: Gaussian 09
title: 000228595
version: EM64L-G09RevD.01
frameworkgroup: C1[X(C16H20N4O6)]
method: RPBEPBE
basis: SDD
operation: Freq
keyword: #p
keyword: freq=noraman
keyword: PBEPBE/SDD
title: #p freq=noraman PBEPBE/SDD
converged: NO YES NO NO
title: Mulliken charges:
elementType: O O O O O O N N N N C C C C C C C C C C C C C C C C H H H H H H H H H H H H H H H H H H H H
charge: -0.240429 -0.241955 -0.225692 -0.229245 -0.220145 -0.203061 -0.111054 -0.236471 -0.066733 0.047981 -0.063248 -0.367615 -0.352280 -0.331803 -0.387419 -0.312272 -0.318995 0.266224 0.203702 -0.763160 -0.275280 -0.303403 0.403101 -0.359339 -0.305548 0.270758 0.244384 0.214192 0.228990 0.203667 0.214923 0.204047 0.204591 0.264849 0.250279 0.220134 0.192484 0.191575 0.221037 0.227904 0.228301 0.298687 0.265019 0.282628 0.271507 0.294185
chargesum: 0.00000
title: Mulliken charges with hydrogens summed into heavy atoms:
elementType: O O O O O O N N N N C C C C C C C C C C C C C C C C
charge: -0.240429 -0.241955 -0.225692 -0.229245 -0.220145 -0.203061 -0.111054 -0.236471 -0.066733 0.047981 0.181135 0.075567 0.066309 0.076835 0.127710 0.100346 0.093617 0.266224 0.203702 -0.008269 -0.010261 -0.020775 0.403101 -0.087832 -0.011363 0.270758
polarizability: 5.14009386e+02 7.18697743e+01 1.91162404e+02 -1.54894401e+01 2.18426927e+01 2.01151025e+02
1716.lowfreq: -7.6377 -3.2690 -0.0006 0.0004 0.0010 5.2108 11.3147 17.9077 23.4818
frequency: 10.9042 17.8814 22.6477 31.7133 42.8572 52.8486 61.0610 83.0125 92.6656 105.5810 126.7985 148.9082 169.9409 178.7316 184.8552 194.6305 210.9594 213.8486 237.6375 278.4290 296.6536 317.2776 324.9232 347.4285 351.6793 368.8798 384.2056 398.6632 424.8448 448.6076 461.5270 469.1427 509.0287 523.7173 546.8011 552.7124 562.4316 599.5499 655.4333 660.0273 676.9279 688.4395 714.6581 726.4305 753.0720 766.3131 774.4932 806.8968 809.0136 839.3070 858.9048 883.6250 887.4738 904.3439 905.1437 909.2254 919.0097 924.0473 967.6112 973.2430 991.6099 1001.3140 1019.7359 1025.8829 1026.5979 1041.3631 1052.0606 1052.5721 1072.9697 1094.4828 1106.6787 1128.8460 1131.3769 1140.9463 1154.8633 1172.2284 1183.2687 1190.0926 1195.1040 1221.8448 1227.8977 1245.7879 1258.6993 1272.6206 1285.5022 1289.4393 1290.3894 1297.0859 1310.0911 1326.5098 1330.1961 1333.9795 1342.2440 1346.9713 1365.1193 1372.6212 1373.5406 1386.6822 1393.9575 1443.0143 1443.2528 1448.7395 1450.0827 1460.5113 1466.9206 1474.5276 1488.0983 1492.3762 1503.4027 1543.0817 1634.1354 1690.4347 2881.6076 2887.1876 2917.0818 2953.5288 2957.8091 2987.6867 3005.6263 3029.0999 3033.7080 3034.8911 3076.9705 3083.3681 3084.2318 3087.6940 3095.8759 3097.6758 3141.1407 3151.1610 3229.8990 3259.1095
redmass: 6.3040 6.0899 3.5112 5.0670 6.4963 5.3841 8.1696 5.9688 5.8856 5.3078 5.9159 4.6726 6.1503 4.5040 3.3898 1.0841 6.0784 4.2286 1.8382 6.5579 2.9248 3.2903 3.1660 3.0237 3.8459 7.0946 2.5833 3.5371 3.0776 4.8515 5.9094 2.7717 5.5456 3.5933 4.3734 4.6035 5.2062 2.0119 9.7889 4.8352 8.6073 7.1954 5.4482 7.6934 7.2462 5.7720 4.3001 1.3208 3.7373 1.6081 2.7838 1.8479 2.2543 2.8737 1.8760 6.2782 2.3328 6.1984 2.3849 1.2479 1.9565 2.5502 2.3502 1.9571 1.4167 1.5942 1.9217 1.9738 2.6151 2.5763 2.3775 4.4139 2.7379 1.6969 3.3970 4.8592 2.0901 1.2419 1.4276 3.9009 1.3613 1.6684 1.3162 1.3351 1.7602 2.2655 2.1680 1.3298 2.4483 1.4940 1.3098 1.5069 10.1839 1.2788 1.4084 1.2659 3.7184 1.4363 1.2037 1.0839 1.1609 1.0798 1.0955 1.0961 1.1246 1.0910 6.1621 1.2195 3.2015 6.0221 6.0486 11.6915 1.0699 1.0687 1.0678 1.0669 1.0668 1.0359 1.0648 1.0911 1.0915 1.0911 1.0968 1.0889 1.0958 1.0976 1.1005 1.1005 1.0947 1.0873 1.0960 1.1031
irintensity: 1.3112 1.7494 0.9256 0.6985 2.2164 1.1031 0.6500 2.1744 0.4649 3.2329 3.2627 8.0723 6.9281 5.2960 1.8759 4.8006 2.6802 2.2552 1.1943 3.8698 8.5811 6.7295 1.6007 3.4299 7.9021 5.7591 2.4733 4.2722 5.4937 20.0699 15.5351 0.8958 1.6107 24.7436 2.6779 2.3344 1.1962 5.5857 41.7890 1.7788 10.3214 20.4089 65.5365 9.3905 2.3030 9.9206 2.0083 61.7102 19.4956 0.5365 26.8657 6.4044 8.6788 10.3287 8.1686 6.0200 27.3338 0.5571 29.2949 99.3040 236.5230 35.1160 196.1528 36.9829 74.2714 3.7013 79.8561 14.9425 15.1884 93.6910 7.7242 174.1032 102.6985 24.2572 496.4396 133.7710 21.0972 0.6854 8.5114 543.2942 14.6597 75.8721 7.4757 4.2028 66.3703 99.1592 24.1671 12.8400 1.1622 90.3501 3.5234 5.2660 124.2322 6.8669 0.8549 2.3858 12.1329 0.4399 49.8065 3.1699 22.7807 2.2607 16.1563 7.9945 15.6793 22.0758 389.5836 11.2716 34.4408 37.8038 26.1539 403.4861 44.8715 108.1960 76.3070 28.2780 94.6055 11.1311 25.8134 19.4204 32.4001 44.5249 6.8359 52.7847 35.0673 36.2839 10.4658 12.8749 1.7815 4.7648 0.6292 4.8725
temp: 298.150 k
press: 1.00000 atm
elementType: 8 8 8 8 8 8 7 7 7 7 6 6 6 6 6 6 6 6 6 6 6 6 6 6 6 6 1 1 1 1 1 1 1 1 1 1 1 1 1 1 1 1 1 1 1 1
symmnumber: 1
zpe: 932756.6 jmol-1
zpe.correction: 0.355268 hartree
zpe.thermalcorrener: 0.379758 hartree
zpe.thermalcorrenthalpy: 0.380702 hartree
zpe.thermalcorrgfe: 0.296591 hartree
zpe.sumelectzpe: -1289.918644 hartree
zpe.sumelectthermal: -1289.894154 hartree
zpe.sumelectthermalent: -1289.893210 hartree
zpe.sumelectthermalfe: -1289.977321 hartree
dipole: 6.5964 -2.6969 -3.3552
dipole: 7.8768
quadrupole: -207.9147 -173.6598 -139.9166
quadrupole: 0.6192 20.6461 6.8787
quadrupole: -34.0843 0.1705 33.9138 0.6192 20.6461 6.8787
hfenergy: -1290.273912 hartree
pointgroup: C01 [X(C16H20N4O6)]
dipole: 2.5391588 -0.8802638 -1.5431695 debye
polarizability: 517.4231584|65.0336036|180.2350869|-8.9519425|17.3738541|208.6645696 unknown
InChI: InChI=1S/C16H20N4O6/c1-12(2-3-13-4-5-15(25-13)20(22)23)17-19-11-14(26-16(19)21)10-18-6-8-24-9-7-18/h2-5,14H,6-11H2,1H3
charge 0 multiplicity 1
46 atoms
O  3.15177 2.434537 -0.236247
O  7.067098 -2.921481 -0.244733
O  1.134753 3.313959 0.578043
O  -4.976958 -0.335727 0.317102
O  -8.435642 -1.276429 0.233251
O  -7.097951 -0.620741 1.990999
N  5.086049 -0.811954 0.010752
N  1.353424 1.023529 -0.106132
N  0.020458 0.599635 -0.192965
N  -7.302683 -0.885081 0.740834
C  3.627652 1.07728 -0.671995
C  4.488965 0.46794 0.453265
C  5.357787 -1.756037 1.129305
C  6.312735 -0.627679 -0.813451
C  2.325241 0.292212 -0.950335
C  5.850777 -3.099264 0.56584
C  6.795223 -1.986542 -1.347016
C  1.790158 2.349695 0.14835
C  -0.805873 0.861183 0.824137
C  -0.414096 1.432326 2.168951
C  -2.207322 0.477823 0.620153
C  -2.743347 0.11509 -0.595975
C  -4.10598 -0.284016 -0.800458
C  -4.821283 -0.662922 -1.952568
C  -6.162559 -0.956678 -1.558707
C  -6.216663 -0.746886 -0.181983
H  4.221017 1.243688 -1.584092
H  3.840346 0.276445 1.328988
H  5.25116 1.219536 0.764983
H  6.127439 -1.350527 1.831159
H  4.423632 -1.917238 1.699581
H  6.093485 0.039553 -1.667634
H  7.130179 -0.156882 -0.213319
H  2.422928 -0.759451 -0.640842
H  2.011153 0.332423 -2.009941
H  6.134301 -3.790208 1.376461
H  5.050591 -3.558062 -0.054427
H  6.025268 -2.415792 -2.024183
H  7.749623 -1.883324 -1.888801
H  0.619757 1.14206 2.431393
H  -1.101841 1.06946 2.951289
H  -0.437713 2.536225 2.155599
H  -2.856822 0.504303 1.502946
H  -2.101069 0.125937 -1.483338
H  -4.410433 -0.714614 -2.958796
H  -6.993338 -1.278505 -2.180744
