program: Gaussian 09
title: 000228601
version: EM64L-G09RevD.01
frameworkgroup: C1[X(C22H31FO3)]
method: RPBEPBE
basis: SDD
operation: Freq
keyword: #p
keyword: freq=noraman
keyword: PBEPBE/SDD
title: #p freq=noraman PBEPBE/SDD
converged: YES YES NO NO
title: Mulliken charges:
elementType: F O O O C C C C C C C C C C C C C C C C C C C C C C H H H H H H H H H H H H H H H H H H H H H H H H H H H H H H H
charge: -0.234298 -0.439707 -0.214700 -0.234698 -0.087666 0.358894 -0.263886 0.285859 0.161951 -0.621706 -0.253515 -0.227370 -0.545856 -0.447780 -0.482600 0.603370 -0.866601 -0.653301 -0.539923 -0.812649 0.166240 -0.193086 -0.604877 0.172280 -0.800531 -0.737542 0.254841 0.240369 0.233100 0.240940 0.267102 0.240830 0.218601 0.231603 0.222509 0.238862 0.262843 0.216734 0.282403 0.227538 0.206996 0.220769 0.242730 0.239316 0.238899 0.209502 0.280634 0.227680 0.231211 0.251039 0.361114 0.245432 0.248573 0.256887 0.215169 0.249726 0.209745
chargesum: 0.00000
title: Mulliken charges with hydrogens summed into heavy atoms:
elementType: F O O O C C C C C C C C C C C C C C C C C C C C C C
charge: -0.234298 -0.078593 -0.214700 -0.234698 0.167175 0.358894 -0.023517 0.285859 0.161951 -0.147666 0.013587 0.013460 -0.095651 0.013591 -0.003023 0.603370 -0.149663 -0.189802 -0.061708 -0.094834 0.166240 0.038125 -0.353838 0.172280 -0.049638 -0.062902
polarizability: 3.07148578e+02 -5.32324718e+00 2.19874605e+02 -1.41003469e+01 3.20008054e+00 1.86822586e+02
1716.lowfreq: -9.5169 -0.0010 -0.0005 0.0004 7.4590 10.5651 33.8329 46.2857 55.8136
frequency: 33.7803 46.2674 55.8035 72.0715 84.7841 103.3200 118.8012 123.8963 136.8219 149.1560 163.6704 172.9144 185.8929 196.8787 206.0646 211.5707 223.8973 240.0392 249.3062 259.3154 266.9502 273.3150 295.3434 297.8950 302.1777 312.1963 325.9000 338.4949 360.6890 364.2089 382.1017 386.6281 393.8710 432.2406 461.4348 462.6680 504.7681 518.0266 541.6405 551.3275 570.2368 580.3607 585.8643 619.1077 634.8289 644.3375 673.5570 691.4949 700.3981 743.7430 755.9455 793.3911 819.5764 835.8394 850.1967 853.3871 863.8902 892.7111 906.9066 917.7078 920.6083 930.5644 934.4847 939.3511 956.1219 962.2226 972.5613 986.2024 1006.8274 1015.1259 1016.4799 1025.5848 1042.4282 1046.5916 1068.3868 1070.2041 1071.5005 1097.7966 1100.3795 1115.2549 1120.3580 1131.0115 1145.9187 1154.6417 1161.0259 1166.0518 1182.0009 1184.6535 1203.3264 1207.4460 1214.6417 1217.3651 1224.7916 1230.2076 1238.8801 1251.2755 1257.8445 1271.7022 1275.9522 1287.4244 1291.1813 1300.3979 1316.2504 1324.6110 1326.6645 1332.4103 1342.6144 1345.7769 1346.8746 1355.4338 1362.2499 1368.9265 1370.7083 1376.1996 1385.9476 1387.7155 1403.2003 1442.8433 1449.2912 1454.6428 1458.5667 1465.7317 1466.9697 1470.9619 1471.4347 1473.4970 1479.6816 1480.1659 1493.0679 1499.6136 1504.3282 1580.9361 1622.6906 1636.0767 2940.3084 2953.7213 2958.3101 2971.7759 2976.7297 2980.3017 2981.2295 2986.0225 2986.4497 2991.4931 2992.4843 2994.5749 2996.7959 3015.5652 3041.1120 3041.4251 3053.1154 3053.4414 3055.2222 3059.2580 3059.6342 3060.0325 3078.3029 3079.5960 3080.7660 3084.3077 3101.2976 3115.9733 3118.0084 3120.2535 3584.0496
redmass: 6.8048 4.0424 4.8802 3.9375 4.6571 2.8113 2.7011 1.2650 2.5021 2.9849 3.0351 1.2457 1.2244 3.8285 2.6875 3.0210 3.1523 1.7498 3.2298 2.1184 2.8811 2.6347 3.5714 1.7762 3.1267 1.9540 3.6287 3.8415 3.0621 2.5440 2.8107 3.3158 3.7886 3.5291 3.2294 3.5448 3.1659 3.6889 3.5517 3.3921 3.4250 3.5613 3.4154 3.8209 3.9115 3.3438 3.1882 2.8466 2.6742 2.7218 3.4796 2.7023 2.0609 1.9483 2.9857 2.3390 1.9689 1.6176 1.9181 2.8833 2.4228 1.8308 1.8963 1.8791 2.0264 1.9282 2.0077 2.2754 2.1656 1.6916 2.0454 1.9981 2.1492 2.2510 2.4322 2.3561 2.1116 3.3616 1.9148 1.7969 2.3879 2.3362 2.2131 2.0426 2.2440 1.8749 2.1428 2.2980 1.6070 1.7747 1.6176 1.3849 1.6026 1.8223 1.5769 1.4439 1.4326 1.3898 1.3338 1.5257 1.4380 1.4515 1.6385 1.4762 1.4228 1.6094 1.9600 1.4320 1.5749 1.4520 1.3694 1.2471 1.1859 1.3917 1.2146 1.2088 1.1941 1.0765 1.0754 1.0709 1.0828 1.0540 1.0852 1.0719 1.0600 1.0656 1.0749 1.0655 1.0744 1.0563 1.0529 9.7408 7.1273 8.0880 1.0801 1.0662 1.0797 1.0425 1.0405 1.0756 1.0633 1.0776 1.0374 1.0578 1.0623 1.0386 1.0605 1.0627 1.0989 1.0949 1.0990 1.1021 1.0996 1.1000 1.0947 1.0897 1.0999 1.1020 1.0983 1.0968 1.0988 1.1000 1.0911 1.1004 1.0656
irintensity: 2.4718 2.2572 3.1237 1.9654 0.9682 3.2728 1.3202 2.6295 2.5037 1.6003 13.1337 28.0086 5.4174 3.9409 36.5099 2.7246 8.3844 5.3446 1.2787 1.8953 1.3941 5.0901 8.5973 11.8120 1.1645 2.5781 3.0947 1.7335 2.8884 1.6495 2.3842 0.8469 1.7055 3.3800 0.8965 2.1339 11.2447 0.7195 0.2693 7.7966 0.8234 8.8942 4.6651 4.8566 1.5052 1.7319 0.6079 2.3801 5.4398 5.1505 4.6341 3.2183 0.8499 8.1883 23.2056 12.0488 2.0626 31.2577 4.0895 5.7366 2.4312 0.8231 10.7388 9.1121 21.9367 21.1743 7.4278 14.7841 10.8133 1.8679 6.4060 6.1498 7.0801 10.1874 4.6984 0.0851 19.1073 10.1461 4.2089 18.2042 1.7182 10.2404 17.8621 6.3452 26.8154 28.8390 19.6278 2.0057 1.6382 29.3874 41.4981 10.8051 12.1342 47.1163 12.0369 1.9167 36.6556 9.7665 7.5791 10.3476 5.6218 6.5885 2.5415 17.8029 7.9984 34.9567 7.7020 4.1448 4.3254 2.6118 9.6877 61.7722 14.6261 8.9212 23.4166 22.8851 38.8503 17.3770 9.7327 13.4091 15.9099 14.0060 6.6504 11.4221 10.5162 6.3358 8.1394 5.2779 11.6792 4.7491 10.0034 178.8024 106.9866 138.0362 12.3730 17.3707 1.7588 22.0120 2.1272 8.0832 24.3408 15.6098 29.1535 22.4111 34.8660 46.4714 32.7791 29.6928 29.1131 11.6592 46.5238 9.1022 19.1172 9.0638 11.1113 26.3548 31.1843 38.6772 38.4816 11.9787 16.3239 3.1394 12.0383 15.9022 24.2158
temp: 298.150 k
press: 1.00000 atm
elementType: 9 8 8 8 6 6 6 6 6 6 6 6 6 6 6 6 6 6 6 6 6 6 6 6 6 6 1 1 1 1 1 1 1 1 1 1 1 1 1 1 1 1 1 1 1 1 1 1 1 1 1 1 1 1 1 1 1
symmnumber: 1
zpe: 1274286.2 jmol-1
zpe.correction: 0.485350 hartree
zpe.thermalcorrener: 0.511118 hartree
zpe.thermalcorrenthalpy: 0.512062 hartree
zpe.thermalcorrgfe: 0.432398 hartree
zpe.sumelectzpe: -1180.449660 hartree
zpe.sumelectthermal: -1180.423892 hartree
zpe.sumelectthermalent: -1180.422948 hartree
zpe.sumelectthermalfe: -1180.502611 hartree
dipole: -4.3726 0.6982 1.0177
dipole: 4.5435
quadrupole: -207.0896 -149.4301 -156.1655
quadrupole: 1.0006 22.6521 4.7200
quadrupole: -36.1946 21.4650 14.7296 1.0006 22.6521 4.7200
hfenergy: -1180.9350096 hartree
pointgroup: C01 [X(C22H31F1O3)]
dipole: -1.7191234 0.2780451 0.4032237 debye
polarizability: 307.1178465|-5.6178499|219.8100019|-14.0148623|3.9046845|186.9179197 unknown
InChI: InChI=1S/C22H31FO3/c1-12-10-21(4)14(9-18(12)25)5-6-17-16-8-7-15(13(2)24)20(16,3)11-19(26)22(17,21)23/h9,12,15-17,19,26H,5-8,10-11H2,1-4H3
charge 0 multiplicity 1
57 atoms
F  0.68115 0.049408 -1.501136
O  -0.218118 -2.064239 1.418153
O  -5.807241 -0.505732 0.564876
O  5.93661 0.178933 -1.050831
C  -1.71947 1.109637 -0.266519
C  -2.517719 -0.191706 0.057047
C  -0.322609 1.171825 0.388772
C  0.505877 -0.084308 -0.006981
C  1.976965 -0.09754 0.567662
C  -1.699625 -1.387668 -0.487479
C  -0.255346 -1.455328 0.07529
C  -3.847567 0.129828 -0.747373
C  -2.729307 2.24671 0.013053
C  0.424035 2.460491 -0.0405
C  -4.099508 1.646977 -0.453706
C  2.655323 1.225616 0.169722
C  -2.851102 -0.33556 1.569992
C  1.887048 2.501382 0.459889
C  2.745243 -1.31563 -0.028417
C  1.989577 -0.177171 2.131986
C  -5.029511 -0.776158 -0.392131
C  4.284125 -1.22986 0.110531
C  3.925748 1.267654 -0.338521
C  4.797746 0.085492 -0.497706
C  -5.228223 -2.023083 -1.243879
C  4.990032 -2.462115 -0.488463
H  -1.541722 1.090812 -1.363475
H  -0.426933 1.177974 1.493374
H  -1.626961 -1.296336 -1.588586
H  -2.181002 -2.360143 -0.265082
H  0.3208 -2.162345 -0.544037
H  -3.608969 -0.018256 -1.820034
H  -2.479168 3.173763 -0.531123
H  -2.752554 2.496637 1.091266
H  -0.120936 3.34254 0.343774
H  0.413869 2.519405 -1.144762
H  -4.877226 1.748432 0.322814
H  -4.474598 2.152738 -1.360858
H  -3.659226 0.349185 1.876562
H  -3.213217 -1.355577 1.800726
H  -1.982353 -0.109713 2.217918
H  1.879936 2.661054 1.559677
H  2.415799 3.36793 0.023442
H  2.505359 -1.393939 -1.106134
H  2.392275 -2.240801 0.463867
H  1.416423 0.642206 2.600082
H  1.561826 -1.135262 2.462623
H  3.029918 -0.095751 2.493142
H  4.541531 -1.176492 1.192242
H  4.376209 2.22714 -0.625333
H  -1.001049 -1.761634 1.940983
H  -5.579688 -1.726597 -2.252057
H  -4.276127 -2.566127 -1.38853
H  -5.978241 -2.687676 -0.787625
H  4.712685 -2.594216 -1.550537
H  6.084928 -2.339533 -0.44639
H  4.708778 -3.379173 0.06054
