program: Gaussian 09
title: 000228533
version: EM64L-G09RevD.01
frameworkgroup: C1[X(C16H14O6S)]
method: RPBEPBE
basis: SDD
operation: Freq
keyword: #p
keyword: freq=noraman
keyword: PBEPBE/SDD
title: #p freq=noraman PBEPBE/SDD
converged: YES YES NO NO
title: Mulliken charges:
elementType: S O O O O O O C C C C C C C C C C C C C C C C H H H H H H H H H H H H H H
charge: 0.869759 -0.533829 -0.533837 -0.281703 -0.281692 -0.217801 -0.217812 -0.087658 -0.087667 -0.212770 -0.212772 -0.224679 -0.224669 -0.375636 -0.375639 -0.299220 -0.299211 0.374115 0.374090 0.263465 0.263483 -0.745804 -0.745811 0.284903 0.284910 0.279921 0.279907 0.267777 0.267776 0.311673 0.311688 0.255281 0.256665 0.250424 0.255282 0.256664 0.250428
chargesum: 0.00000
title: Mulliken charges with hydrogens summed into heavy atoms:
elementType: S O O O O O O C C C C C C C C C C C C C C C C
charge: 0.869759 -0.533829 -0.533837 -0.281703 -0.281692 -0.217801 -0.217812 -0.087658 -0.087667 0.072134 0.072138 0.055243 0.055238 -0.107859 -0.107862 0.012453 0.012477 0.374115 0.374090 0.263465 0.263483 0.016566 0.016562
polarizability: 3.02785117e+02 1.75291346e-03 1.76985658e+02 -2.90783957e+00 4.95563580e-03 2.03697668e+02
1716.lowfreq: -5.0496 -3.1774 -2.1871 -0.0018 -0.0017 0.0002 13.8413 23.7712 24.3772
frequency: 13.8387 23.7568 24.3744 43.0283 46.2677 50.4283 55.2960 61.0952 72.4621 91.0593 108.1463 132.8191 161.3287 167.3724 183.0547 203.5569 206.5448 267.4981 302.3674 310.9023 320.9926 352.0417 354.3424 360.0723 403.8402 413.6452 415.1597 424.3827 469.9467 521.2350 528.0233 543.9739 553.5263 554.0844 562.2699 610.3871 612.3309 666.5689 670.6667 721.4380 723.3286 742.5496 747.2598 786.7496 842.4092 846.6312 860.1686 865.2964 879.1065 880.8121 925.3128 968.9373 971.6557 984.7941 987.6019 989.3323 991.3935 993.1504 995.5035 1040.6730 1040.7083 1048.8717 1054.7003 1108.2351 1114.2921 1145.0522 1152.8881 1173.0327 1174.2192 1188.2553 1191.6258 1284.2538 1287.5800 1382.5682 1384.3317 1385.8543 1387.5655 1396.3898 1398.4735 1451.1930 1451.2105 1451.9246 1451.9490 1460.2077 1463.5831 1581.5236 1581.9299 1599.6623 1602.7220 1667.6424 1667.7720 3009.6733 3009.6769 3097.3512 3097.3670 3146.7539 3146.7653 3155.1607 3155.4547 3156.8715 3157.1753 3178.3339 3178.4744 3214.2723 3214.2933
redmass: 7.6899 6.0000 4.1114 3.6286 2.7691 3.3198 1.3986 1.3855 2.8172 8.8623 6.3834 6.5119 7.2932 6.6309 8.0447 7.6810 8.3271 7.6615 6.7769 6.8473 7.9934 4.7720 4.9884 4.8998 6.3039 2.9918 3.0088 8.1052 6.9377 3.1314 3.0801 4.5638 3.1806 3.1242 5.2884 6.9929 7.0163 6.9089 7.0004 3.7838 3.8749 6.7685 6.5543 14.1473 1.2643 1.2894 1.4713 1.5492 6.7945 6.1550 16.9289 1.3513 1.3591 1.3594 1.3499 3.7784 2.6587 2.3192 2.9206 1.6447 1.6448 2.3637 2.3715 1.2772 1.2869 2.1705 2.1613 2.8780 3.1144 1.7399 1.6949 1.2581 1.2554 3.4943 1.4767 1.5720 4.2902 3.3717 3.2450 1.0647 1.0614 1.0477 1.0476 2.2298 2.2412 6.4564 6.3541 7.6685 7.8527 9.8504 9.8213 1.0368 1.0368 1.0973 1.0973 1.1012 1.1012 1.0902 1.0903 1.0904 1.0905 1.0967 1.0967 1.0945 1.0945
irintensity: 0.0691 2.9551 4.0113 1.8178 0.0750 0.3954 0.2698 0.0231 0.6934 2.3308 0.8094 7.9977 0.7283 6.1471 0.0794 9.2629 5.6078 0.9612 13.0470 1.4617 4.8323 0.3529 17.2836 3.2985 0.0680 0.0683 0.0190 14.7427 59.8688 24.2129 25.8740 50.6857 7.0840 0.4337 205.6007 0.8967 14.0270 3.5866 2.2447 3.6571 0.0945 6.0546 9.9758 107.0483 4.1544 3.8128 31.2322 97.6604 108.7449 19.5612 75.4252 4.7894 0.6818 0.1785 6.1735 6.3588 26.6600 206.8227 40.6163 7.5538 11.2138 47.2821 11.7613 0.1638 26.9980 798.5609 219.9258 358.1696 174.0190 110.9639 62.4241 2.1255 8.7195 0.8232 58.4399 37.4889 54.3165 1.0858 31.8560 47.1203 4.6641 16.1437 21.8483 159.6671 48.9989 25.7492 44.3310 2.8291 3.8391 348.7140 8.2784 0.5131 0.5022 4.6771 5.5642 14.7797 4.4136 0.0789 2.2255 1.2562 2.6619 6.6771 2.4194 8.8549 2.1472
temp: 298.150 k
press: 1.00000 atm
elementType: 16 8 8 8 8 8 8 6 6 6 6 6 6 6 6 6 6 6 6 6 6 6 6 1 1 1 1 1 1 1 1 1 1 1 1 1 1
symmnumber: 1
zpe: 695357.1 jmol-1
zpe.correction: 0.264848 hartree
zpe.thermalcorrener: 0.287925 hartree
zpe.thermalcorrenthalpy: 0.288869 hartree
zpe.thermalcorrgfe: 0.207575 hartree
zpe.sumelectzpe: -1465.692344 hartree
zpe.sumelectthermal: -1465.669266 hartree
zpe.sumelectthermalent: -1465.668322 hartree
zpe.sumelectthermalfe: -1465.749617 hartree
dipole: 0.0001 -6.8801 0.0000
dipole: 6.8801
quadrupole: -102.4715 -158.3192 -141.0097
quadrupole: -0.0003 22.7156 0.0042
quadrupole: 31.4619 -24.3857 -7.0762 -0.0003 22.7156 0.0042
hfenergy: -1465.9571917 hartree
pointgroup: C01 [X(C16H14O6S1)]
dipole: -0.0036857 -2.7068471 0.0014066 debye
polarizability: 301.6745911|-0.1754518|176.9859172|-10.8275922|0.0341385|204.8079347 unknown
InChI: InChI=1S/C16H14O6S/c1-11(17)21-13-3-7-15(8-4-13)23(19,20)16-9-5-14(6-10-16)22-12(2)18/h3-10H,1-2H3
charge 0 multiplicity 1
37 atoms
S  0.002319 2.366039 -0.001438
O  0.031027 3.137079 -1.446477
O  -0.024102 3.138714 1.442775
O  -4.911783 -1.197489 -0.273216
O  4.906277 -1.211104 0.274166
O  -5.421502 -1.686418 1.97865
O  5.414999 -1.703049 -1.977251
C  -1.508639 1.223292 -0.034553
C  1.509928 1.21892 0.032909
C  -2.039004 0.865271 -1.285168
C  2.039375 0.860896 1.283908
C  -2.078986 0.835655 1.185714
C  2.079008 0.828131 -1.186945
C  -3.183571 0.045454 -1.302827
C  3.181618 0.037869 1.30246
C  -3.227472 0.011503 1.171631
C  3.225165 0.000762 -1.171966
C  -3.761393 -0.379963 -0.08192
C  3.758146 -0.390619 0.082013
C  -5.673616 -1.797869 0.764431
C  5.666827 -1.814043 -0.762931
C  -6.810963 -2.571745 0.141095
C  6.802233 -2.590185 -0.138875
H  -1.586494 1.241386 -2.2082
H  1.587986 1.239404 2.206512
H  -1.654557 1.19047 2.130722
H  1.655478 1.182991 -2.132339
H  -3.64539 -0.266352 -2.243668
H  3.64265 -0.274093 2.243635
H  -3.694678 -0.31128 2.101694
H  3.691365 -0.324485 -2.101676
H  -6.417866 -3.33154 -0.556169
H  -7.455673 -1.893193 -0.444002
H  -7.401358 -3.057785 0.93054
H  6.407349 -3.347202 0.560372
H  7.449523 -1.912335 0.444214
H  7.390576 -3.079683 -0.927716
