program: Gaussian 09
title: 000228532
version: EM64L-G09RevD.01
frameworkgroup: C1[X(C15H13NO2)]
method: RPBEPBE
basis: SDD
operation: Freq
keyword: #p
keyword: freq=noraman
keyword: PBEPBE/SDD
title: #p freq=noraman PBEPBE/SDD
converged: YES YES NO NO
title: Mulliken charges:
elementType: O O N C C C C C C C C C C C C C C C H H H H H H H H H H H H H
charge: -0.232985 -0.249016 -0.438122 0.315169 0.483158 0.003265 0.294448 -0.363784 -0.352908 -0.362923 -0.452883 -0.372689 -0.360705 -0.236876 -0.232192 -0.230402 0.215554 -0.798169 0.268923 0.274012 0.310631 0.221809 0.267492 0.270702 0.313076 0.231514 0.231935 0.232438 0.239633 0.271424 0.238472
chargesum: 0.00000
title: Mulliken charges with hydrogens summed into heavy atoms:
elementType: O O N C C C C C C C C C C C C C C C
charge: -0.232985 -0.249016 -0.125046 0.315169 0.483158 0.003265 0.294448 -0.094861 -0.078896 -0.052293 -0.231074 -0.105197 -0.090002 -0.005362 -0.000257 0.002036 0.215554 -0.048641
polarizability: 3.01597778e+02 3.01204808e+00 1.75402486e+02 1.43978409e+01 -7.81428956e-01 9.33156268e+01
1716.lowfreq: -64.2621 -10.9546 -4.5494 -0.0006 -0.0004 -0.0003 3.8753 38.4528 46.4501
frequency: -64.2528 38.4405 46.4406 50.2978 77.3655 95.3754 132.3876 140.7760 194.0083 226.6043 233.0896 300.9346 331.7635 359.0872 395.9753 403.2336 417.0913 443.6963 503.6380 543.7204 571.0601 585.0361 613.3541 628.6638 651.5735 654.6762 684.3543 703.3391 712.0504 751.9200 800.7187 822.0863 843.4699 859.7730 877.8648 913.8030 931.2188 945.9208 974.5803 985.3813 986.4589 989.2039 1000.2980 1004.4554 1008.9098 1026.3789 1032.5365 1083.5145 1124.2212 1152.5953 1173.9517 1185.3529 1193.6695 1219.3446 1265.1893 1286.1592 1309.4647 1319.2768 1364.1415 1377.8484 1382.5655 1419.4433 1432.5900 1447.4386 1468.7702 1475.6186 1485.7499 1507.4639 1534.6028 1582.3152 1588.2643 1606.9999 1618.9716 1639.7216 2988.6059 3073.5954 3113.3818 3127.4984 3137.3891 3137.7056 3148.3228 3152.0270 3158.6264 3160.9009 3168.8591 3196.5199 3517.5383
redmass: 1.0540 4.0407 6.8842 4.7480 4.2950 4.5017 5.5797 5.1347 4.9034 7.9670 4.5644 5.3665 4.6624 5.8593 5.0793 2.8583 3.0100 4.0692 3.4278 4.1550 4.7411 3.0020 6.4525 7.0301 5.4077 1.1822 4.1311 1.9558 3.3998 2.9340 2.4954 4.4883 1.4109 1.2927 1.5312 5.3272 6.0338 1.4977 1.3981 1.6780 1.3980 6.0487 1.3319 1.3363 2.5771 2.1505 1.6660 1.5843 1.3491 3.1036 1.0567 1.1250 1.1680 3.3165 1.8668 3.1691 1.5940 1.3535 4.3515 1.2465 8.8089 4.1415 2.2647 1.1745 1.0468 2.2147 2.0206 2.9953 6.4978 5.1961 6.2613 5.9958 5.7164 5.4244 1.0384 1.0983 1.0898 1.0850 1.0882 1.0979 1.0921 1.0912 1.0958 1.0946 1.1012 1.0948 1.0764
irintensity: 0.0753 4.7277 6.5684 2.9157 1.6863 1.7020 0.8698 6.9218 0.2545 0.8676 1.4923 4.3940 0.5946 0.8885 11.4291 1.6070 0.2040 4.1735 19.6685 2.7678 4.1835 0.9920 0.3580 1.2847 46.9391 57.0059 13.5617 62.8206 20.3978 36.4986 11.6852 4.5321 25.5889 12.5343 45.6830 45.2750 23.2677 4.4836 7.3079 33.6306 3.3659 1.7456 1.7803 2.2966 1.0706 4.4880 8.1567 12.0003 17.7736 10.9201 0.5068 89.0535 14.9594 101.9600 29.2273 379.0870 202.5854 9.5742 115.7892 66.9266 1.6687 27.0448 10.5528 93.4243 20.5633 0.1672 297.3587 245.9212 66.4235 43.5733 63.5059 38.3159 122.5909 122.3159 7.5861 13.9601 21.8425 0.3695 6.1351 7.1673 25.0981 1.4563 19.0050 5.4532 23.4708 4.6960 14.8147
temp: 298.150 k
press: 1.00000 atm
elementType: 8 8 7 6 6 6 6 6 6 6 6 6 6 6 6 6 6 6 1 1 1 1 1 1 1 1 1 1 1 1 1
symmnumber: 1
zpe: 632939.5 jmol-1
zpe.correction: 0.241074 hartree
zpe.thermalcorrener: 0.256074 hartree
zpe.thermalcorrenthalpy: 0.257018 hartree
zpe.thermalcorrgfe: 0.197428 hartree
zpe.sumelectzpe: -783.361190 hartree
zpe.sumelectthermal: -783.346190 hartree
zpe.sumelectthermalent: -783.345246 hartree
zpe.sumelectthermalfe: -783.404836 hartree
dipole: 3.0636 -0.1185 1.6185
dipole: 3.4668
quadrupole: -73.8088 -111.0419 -106.0387
quadrupole: 24.5823 8.2094 -1.1764
quadrupole: 23.1543 -14.0788 -9.0756 24.5823 8.2094 -1.1764
hfenergy: -783.602264 hartree
pointgroup: C01 [X(C15H13N1O2)]
dipole: 1.1903337 -0.3379749 0.5738081 debye
polarizability: 300.8326017|-5.9001263|159.9046277|18.4617181|31.9413481|109.5786612 unknown
InChI: InChI=1S/C15H13NO2/c1-11(17)16-14-9-7-13(8-10-14)15(18)12-5-3-2-4-6-12/h2-10,16H,1H3
charge 0 multiplicity 1
31 atoms
O  -2.079917 2.265681 1.001801
O  4.246215 -1.600878 -1.14342
N  3.947277 0.062806 0.489026
C  -0.263605 0.762988 0.542911
C  2.542158 0.262667 0.464342
C  -1.719401 1.115777 0.587671
C  -2.763958 0.124478 0.150801
C  0.287173 -0.181353 -0.365075
C  0.623718 1.471504 1.399706
C  1.671811 -0.433976 -0.417688
C  2.001565 1.220465 1.371186
C  -2.602036 -1.279725 0.300922
C  -3.994049 0.629106 -0.351308
C  -3.6473 -2.159452 -0.05711
C  -5.029397 -0.250365 -0.724362
C  -4.858303 -1.648926 -0.579075
C  4.72659 -0.81761 -0.276346
C  6.220377 -0.741244 0.038247
H  -0.368358 -0.70418 -1.068869
H  0.201903 2.221253 2.076681
H  2.090263 -1.151386 -1.125024
H  2.669676 1.767192 2.049495
H  -1.677712 -1.681009 0.729296
H  -4.115612 1.714415 -0.431642
H  4.458036 0.643501 1.159451
H  -3.51953 -3.239403 0.075769
H  -5.969075 0.148177 -1.122255
H  -5.665479 -2.333677 -0.862689
H  6.621927 0.269552 -0.161748
H  6.749717 -1.463346 -0.599296
H  6.421925 -0.98813 1.097202
