program: Gaussian 09
title: 000228525
version: EM64L-G09RevD.01
frameworkgroup: C1[X(C12H11NO2)]
method: RPBEPBE
basis: SDD
operation: Freq
keyword: #p
keyword: freq=noraman
keyword: PBEPBE/SDD
title: #p freq=noraman PBEPBE/SDD
converged: YES YES NO NO
title: Mulliken charges:
elementType: O O N C C C C C C C C C C C C H H H H H H H H H H H
charge: -0.419987 -0.236635 -0.003414 0.430672 0.112239 0.282268 -0.535035 -0.080073 -0.562364 -0.360444 -0.688802 -0.298688 0.052797 -0.251094 -0.229297 0.262168 0.208511 0.251979 0.271427 0.226033 0.223754 0.230819 0.264236 0.231003 0.234462 0.383466
chargesum: 0.00000
title: Mulliken charges with hydrogens summed into heavy atoms:
elementType: O O N C C C C C C C C C C C C
charge: -0.036521 -0.236635 -0.003414 0.430672 0.112239 0.282268 -0.064356 -0.080073 -0.310385 -0.089017 -0.008196 -0.034452 0.052797 -0.020091 0.005165
polarizability: 2.08237114e+02 1.15732405e+01 1.54989444e+02 7.44630039e+00 5.33564197e+00 7.32193889e+01
1716.lowfreq: -4.7029 0.0004 0.0006 0.0007 7.0893 11.9205 56.5616 58.4491 68.4311
frequency: 56.5538 58.4419 68.3877 99.3176 185.2686 197.3575 200.5231 210.4728 305.0641 319.6092 355.1599 383.6541 422.6230 454.6381 478.3843 527.2471 543.6887 563.9562 596.2816 612.7341 662.1805 675.5868 712.6124 742.8300 778.6061 792.2688 810.5928 817.5459 885.8676 898.9709 933.7140 962.0815 972.0123 999.0862 1013.4069 1030.3425 1062.3346 1067.9139 1092.6654 1139.8128 1173.8144 1207.6125 1231.8400 1256.6551 1279.4481 1285.1141 1322.8242 1335.6924 1372.9072 1385.2108 1393.5567 1429.4528 1451.6902 1475.6257 1476.3756 1487.4520 1491.9118 1552.6217 1559.8135 1618.6744 1631.0346 2983.5861 3007.3540 3071.5041 3082.8577 3095.0448 3110.5149 3134.9991 3151.5944 3171.2831 3181.6649 3500.1658
redmass: 9.8734 2.9809 3.9104 4.1225 4.3642 4.1956 4.0931 1.1822 4.0249 4.6108 3.9731 4.9830 3.4736 4.2773 3.4462 7.0678 4.0382 3.0603 4.7262 1.5527 5.2989 2.8929 4.9023 4.2406 1.4703 1.3141 3.1248 4.5236 1.7731 4.1321 1.4198 3.4400 1.3879 1.3331 3.6541 2.1094 1.9123 2.2721 1.8773 1.5058 1.3557 2.7048 1.7465 1.5089 1.4971 1.9370 1.7936 3.8057 2.3609 2.4786 1.2056 4.0258 2.4339 1.0473 1.0560 1.0910 3.3910 7.4386 7.5105 6.1085 8.6443 1.0349 1.0657 1.0969 1.1000 1.0996 1.0909 1.0865 1.0909 1.0969 1.0966 1.0638
irintensity: 1.6196 0.3542 1.4039 0.3846 0.4082 2.7074 1.4265 0.0422 1.6250 1.1765 3.1170 0.5288 8.3612 1.8026 1.0966 1.9081 2.7094 21.3490 52.5705 87.7176 5.1355 44.0840 1.5088 3.1914 83.3594 7.5068 0.0631 5.8953 0.6582 22.7959 13.2486 30.9224 4.1800 0.3902 35.8329 15.2664 17.1262 187.5654 28.2405 46.8932 10.0333 6.4030 1.0104 1.6363 8.6044 19.2016 19.2906 12.2498 11.2111 9.4641 10.6849 3.3194 6.9876 13.9433 3.4592 15.8189 51.0871 8.9815 4.2039 3.4317 180.2412 33.3797 30.9889 6.9338 50.7159 21.4392 28.5258 5.5427 13.5475 13.7171 13.3827 37.5092
temp: 298.150 k
press: 1.00000 atm
elementType: 8 8 7 6 6 6 6 6 6 6 6 6 6 6 6 1 1 1 1 1 1 1 1 1 1 1
symmnumber: 1
zpe: 529943.8 jmol-1
zpe.correction: 0.201845 hartree
zpe.thermalcorrener: 0.214676 hartree
zpe.thermalcorrenthalpy: 0.215620 hartree
zpe.thermalcorrgfe: 0.162171 hartree
zpe.sumelectzpe: -668.027554 hartree
zpe.sumelectthermal: -668.014723 hartree
zpe.sumelectthermalent: -668.013779 hartree
zpe.sumelectthermalfe: -668.067228 hartree
dipole: -1.5244 0.8531 -0.7245
dipole: 1.8911
quadrupole: -70.0552 -87.7800 -92.3387
quadrupole: 2.7586 1.7923 -4.4857
quadrupole: 13.3361 -4.3887 -8.9474 2.7586 1.7923 -4.4857
hfenergy: -668.229399 hartree
pointgroup: C01 [X(C12H11N1O2)]
dipole: 0.5829887 -0.35905 -0.2911361 debye
dipolederiv: -0.8759477 0.1312502 0.3913072 0.1874821 -0.3614663 -0.2037045 0.4646299 -0.2472953 -0.7339861 -0.4904143 0.1165093 0.1187759 0.0868613 -0.8475102 0.3033758 0.1758054 0.1316286 -0.5934333 -0.1857827 0.0630247 -0.0166525 0.162132 -0.2472282 -0.009129 -0.0185767 -0.0061679 -0.2287284 0.3682503 0.156505 0.0301198 -0.2739029 -0.1685211 0.0620172 0.0702724 -0.043391 0.0030803 -0.0831129 0.2041971 0.0086275 0.1879558 -0.27828 -0.0001615 0.0070263 0.0076513 -0.0637865 0.0061436 -0.0900648 0.0102193 0.3606641 -0.140107 -0.0182918 -0.0679712 0.0874351 0.0629651 -0.0694405 0.000679 -0.0335096 0.1099665 0.1445803 -0.024977 -0.1774353 -0.0646245 0.0230178 0.2160146 0.1387956 -0.0313163 -0.2326346 -0.0869347 0.0327478 0.0189169 -0.0046851 0.0567603 -0.1620135 -0.0765125 -0.0090238 0.24424 0.4003073 -0.0624225 -0.0096777 -0.0217984 -0.0694833 -0.146382 -0.0242425 0.0051385 -0.061413 0.063461 -0.0045422 0.0236648 -0.0434681 -0.136446 -0.0074309 -0.0129159 -0.0337202 -0.0242345 0.0655211 0.0307539 0.1050446 0.0616645 0.0217509 0.0002957 -0.0621033 -0.0035942 -0.1025525 0.0860696 -0.0163805 -0.0131541 -0.0196665 -0.1450172 1.0234166 -0.4373988 -0.5643574 -0.5092015 1.2435633 -0.2037118 -0.6202274 -0.0385194 0.9355234 -0.0580446 0.0513605 -0.0175039 0.0921175 0.182253 -0.0408723 -0.0272407 -0.0460064 -0.1389555 0.1335089 -0.0690141 -0.0256927 -0.1216672 -0.1102611 0.0021521 -0.0173037 0.0033537 -0.1498107 0.0000667 0.0167013 0.0262579 0.0539086 0.0702183 -0.0890051 0.0405347 -0.044069 0.0001025 0.0397871 -0.005183 -0.0120664 -0.0907967 -0.1277445 0.1158081 -0.000319 0.0673884 0.0389119 -0.0124854 -0.1138626 0.0273307 -0.0974734 -0.0436116 0.0207699 0.0172176 0.0288928 0.1104521 0.1125766 0.0610172 -0.0036024 0.0134185 -0.0002862 0.0090831 0.0087641 0.0162178 0.1505861 0.0848773 0.0822879 0.061238 0.0313599 -0.0185896 -0.1182471 0.0185519 -0.0756997 -0.0401065 -0.2483138 -0.0510021 -0.0126765 -0.0229397 0.1024379 0.003203 -0.0250445 -0.0058497 0.067721 0.0874536 -0.0617748 0.0142402 -0.0247663 -0.1092726 0.0895278 0.0055489 0.0500895 0.0361827 0.0648727 0.0303277 0.0063408 0.0909214 -0.0215153 0.0094565 0.0022758 0.0129323 0.156937 0.0109796 -0.0903107 0.020741 -0.1067495 -0.0506063 0.0299653 0.0266624 0.0318023 0.1505463 -0.1342583 0.0180712 0.0265923 0.0140226 0.0932651 0.0045506 0.0297915 0.006174 0.156869 0.3253836 0.0236585 0.0167871 0.0332816 0.1602577 0.0780341 -0.0377569 0.1560106 0.328347 unknown
polarizability: 207.7531808|9.9321706|153.91534|-13.3707864|-9.5755833|74.7774258 unknown
InChI: InChI=1S/C12H11NO2/c1-2-8-7-13-10-6-4-3-5-9(10)11(8)12(14)15/h3-7,14H,2H2,1H3
charge 0 multiplicity 1
26 atoms
O  2.323542 -1.797169 -1.058327
O  1.060033 -2.57653 0.710413
N  -0.743985 2.204126 -0.236305
C  1.350216 0.890167 -0.340744
C  0.634104 -0.313274 -0.154197
C  -0.807264 -0.273025 0.012804
C  2.863345 1.009168 -0.43982
C  -1.453698 1.024837 -0.048616
C  0.587724 2.110621 -0.366378
C  -1.635367 -1.428728 0.208475
C  3.569286 0.795095 0.927657
C  -2.874792 1.127611 0.082576
C  1.322189 -1.642659 -0.085296
C  -3.021305 -1.29895 0.331802
C  -3.651059 -0.016243 0.270056
H  3.256101 0.283231 -1.169511
H  3.109507 2.021206 -0.812438
H  1.124981 3.057979 -0.505128
H  -1.175037 -2.416419 0.285542
H  3.209992 1.519417 1.680597
H  4.661336 0.923391 0.819458
H  3.384306 -0.22038 1.321337
H  -3.311058 2.129455 0.027515
H  -3.634529 -2.194002 0.483789
H  -4.738895 0.062566 0.370065
H  2.726023 -2.702791 -0.951224
