program: Gaussian 09
title: 000228515
version: EM64L-G09RevD.01
frameworkgroup: C1[X(C10H10Cl2O)]
method: RPBEPBE
basis: SDD
operation: Freq
keyword: #p
keyword: freq=noraman
keyword: PBEPBE/SDD
title: #p freq=noraman PBEPBE/SDD
converged: YES YES NO NO
title: Mulliken charges:
elementType: Cl Cl O C C C C C C C C C C H H H H H H H H H H
charge: -0.018646 -0.061868 -0.393274 0.417312 -0.617332 0.235169 -0.419110 -0.221625 -0.269789 -0.093088 -0.243891 -0.162451 -0.732957 0.232594 0.239053 0.260381 0.268478 0.281442 0.237116 0.232886 0.233104 0.229758 0.366738
chargesum: 0.00000
title: Mulliken charges with hydrogens summed into heavy atoms:
elementType: Cl Cl O C C C C C C C C C C
charge: -0.018646 -0.061868 -0.026536 0.417312 -0.145685 0.235169 -0.158728 0.046852 -0.269789 -0.093088 0.037551 0.074665 -0.037209
polarizability: 1.89975546e+02 1.11507922e+01 1.43251270e+02 -8.99955211e+00 1.92530807e+00 6.92241423e+01
1716.lowfreq: -5.7994 -4.4808 0.0016 0.0023 0.0026 4.4207 41.1280 64.0251 92.7799
frequency: 41.1245 64.0226 92.7716 125.6274 150.2160 170.4041 188.7380 198.5857 221.0668 277.6129 292.6352 297.9180 339.8286 360.7056 392.3774 448.5028 522.4850 534.4802 555.3003 585.9053 615.5544 685.7579 738.7808 779.0185 813.2408 860.8058 868.3211 893.5536 904.9469 947.2196 1002.9602 1047.3388 1069.5198 1086.9261 1115.8820 1145.6353 1181.8913 1194.3696 1242.0767 1275.0851 1292.9927 1295.7026 1327.4636 1385.0437 1398.4468 1407.5807 1443.3660 1459.4712 1463.8559 1469.4905 1566.9213 1610.0335 1670.2035 2969.0037 2973.0571 3026.7095 3048.6720 3067.8200 3091.2277 3098.0041 3157.1793 3187.1263 3345.7570
redmass: 3.9762 4.5208 2.1329 3.5711 3.4921 12.9932 4.8283 1.6644 3.4349 2.5925 4.0227 5.3090 7.5817 11.6029 9.0234 3.4214 3.8595 3.3536 3.6745 1.1316 4.7905 6.7431 4.5527 1.6276 5.9950 1.4078 1.5920 2.7014 2.4569 1.4931 1.0975 1.5557 3.8361 1.8991 1.8897 2.6509 1.9611 1.5368 1.4264 1.2546 1.7159 1.4402 1.4364 4.2768 1.2386 4.4816 1.3412 1.0476 2.1039 1.0648 7.2885 7.4384 5.8285 1.0607 1.0370 1.0991 1.0968 1.0914 1.0981 1.0906 1.0927 1.0935 1.0664
irintensity: 0.4060 0.2953 0.3049 1.2204 0.3341 0.9380 1.4613 1.0596 1.7474 6.7911 2.7865 0.2277 2.0693 1.4166 3.1131 5.0129 4.2584 4.2007 0.1127 95.7088 5.9858 68.1516 5.6569 8.1580 14.9529 26.6906 13.7811 13.7849 4.0992 34.3572 72.0411 0.3461 22.1929 3.2473 0.9858 39.3747 83.0048 29.9325 27.4756 13.9747 20.2284 7.9074 2.0373 28.4301 11.1430 2.8022 49.7262 16.7782 145.2406 17.0036 27.9050 1.2467 5.2045 19.6118 27.3288 9.7357 16.6622 4.1652 8.9991 45.1035 1.3388 0.5442 482.2986
temp: 298.150 k
press: 1.00000 atm
elementType: 17 17 8 6 6 6 6 6 6 6 6 6 6 1 1 1 1 1 1 1 1 1 1
symmnumber: 1
zpe: 449104.0 jmol-1
zpe.correction: 0.171055 hartree
zpe.thermalcorrener: 0.184391 hartree
zpe.thermalcorrenthalpy: 0.185335 hartree
zpe.thermalcorrgfe: 0.130151 hartree
zpe.sumelectzpe: -1381.431482 hartree
zpe.sumelectthermal: -1381.418146 hartree
zpe.sumelectthermalent: -1381.417202 hartree
zpe.sumelectthermalfe: -1381.472386 hartree
dipole: 4.3225 -2.6058 -0.0679
dipole: 5.0476
quadrupole: -79.9495 -95.9960 -90.7153
quadrupole: -5.7869 -0.2326 1.7851
quadrupole: 8.9374 -7.1091 -1.8284 -5.7869 -0.2326 1.7851
hfenergy: -1381.602537 hartree
pointgroup: C01 [X(C10H10Cl2O1)]
dipole: -1.8478708 -0.684075 0.2473308 debye
dipolederiv: -0.1332562 -0.1477664 0.0652372 -0.1493714 -0.624705 0.2338536 0.0681467 0.2468798 -0.1455577 -0.566012 0.3467849 -0.066886 0.3749402 -0.4361397 0.0892218 -0.0640237 0.0812197 -0.0915552 -1.2300397 0.4346433 -0.0951389 0.4682737 -0.5574279 0.0323299 -0.0800818 -0.0188836 -0.3560738 0.1258537 -0.0368038 -0.0480178 0.2648431 -0.0052991 -0.0521706 -0.255893 -0.0155616 -0.0620473 0.0079145 0.0481823 -0.0415176 0.2184781 0.1128548 0.0433949 -0.0326949 0.0173325 0.0847547 0.7545636 -0.5474837 0.1243774 -0.8301782 0.1464759 0.0420211 0.2132894 0.0499126 0.0496222 -0.1639446 0.1446165 -0.054002 0.0437984 -0.1408326 -0.004981 -0.004799 -0.0227565 -0.1032772 -0.260828 -0.1109178 0.032733 -0.3092222 -0.1076272 0.1056722 0.3072038 0.0738882 0.0723196 0.0668156 0.3394763 -0.1513647 0.2048106 0.903696 -0.386779 -0.1037738 -0.4066259 0.0791297 0.6862475 -0.5327225 0.0890803 -0.5896409 0.5339249 -0.148025 0.1146808 -0.140663 -0.0354591 -0.2232389 0.0458121 -0.0029379 0.1156946 -0.2823762 0.0631151 -0.0281521 0.0711125 -0.0943412 0.2039643 -0.1860737 0.0695498 -0.2269461 -0.1953576 0.0766808 0.0996613 0.0525468 0.1576075 -0.1745035 0.0692697 -0.1150098 0.1064179 0.0690557 0.0116206 -0.0474565 0.0062651 -0.0019505 0.0122416 0.0550859 -0.0364562 -0.0140033 -0.0942755 0.0694549 -0.0772683 0.0492949 0.0701991 -0.053961 0.0057187 0.086515 0.010528 0.0445425 -0.1127289 0.0341099 -0.0455634 -0.0507118 0.1008654 -0.0459374 0.0291634 -0.0304837 -0.0060767 0.0672165 0.0116665 0.070205 0.1290752 0.1036287 0.0467753 -0.0044173 0.0722866 0.0948687 -0.064422 -0.0521602 -0.0676039 -0.0801788 0.0285816 -0.0208335 0.0294773 -0.0205173 0.109449 0.0271176 0.0306599 0.0235939 0.1589037 0.0879301 0.0299794 -0.0314531 0.040756 0.1159217 -0.0703474 -0.0335293 -0.077384 -0.1226492 -0.1252416 -0.0615838 0.0297187 -0.1138647 0.0870243 0.0271553 0.0101713 0.0597985 0.0589326 0.0751927 0.0247826 -0.0184141 0.0840063 -0.1133468 0.0356729 -0.098298 0.0200831 0.0855812 0.0744402 0.0466696 0.0806904 0.0213411 0.0610816 -0.0969416 -0.0097427 -0.0606681 -0.091897 0.6027862 0.052326 0.0290729 0.2580531 0.2845692 0.0118683 -0.0017161 0.0335773 0.2895734 unknown
polarizability: 185.2100635|-19.7787979|139.0390947|-1.3319623|-25.3533543|78.2017998 unknown
InChI: InChI=1S/C10H10Cl2O/c1-2-3-4-7-5-8(11)6-9(12)10(7)13/h2-3,5-6,13H,4H2,1H3
charge 0 multiplicity 1
23 atoms
Cl 1.944609 2.712278 -1.08061
Cl 3.712885 -2.300918 0.537386
O  -0.736098 1.689169 -0.264009
C  -0.019307 -0.562549 0.469425
C  -1.438746 -0.927295 0.902376
C  0.256247 0.729366 -0.074286
C  1.04333 -1.479286 0.642152
C  -2.506309 -0.661427 -0.1530
C  1.590179 1.069838 -0.40384
C  2.35491 -1.105918 0.299203
C  2.653716 0.16609 -0.221835
C  -3.663069 0.022637 0.074802
C  -4.757039 0.248557 -0.941416
H  -1.453162 -2.003348 1.162515
H  -1.703265 -0.376563 1.828391
H  0.844515 -2.473896 1.052882
H  -2.32004 -1.094121 -1.147445
H  3.675031 0.450099 -0.48509
H  -3.836725 0.439898 1.080449
H  -5.704422 -0.216459 -0.606381
H  -4.964409 1.32758 -1.074519
H  -4.495467 -0.177659 -1.92519
H  -1.638965 1.257625 -0.236957
