program: Gaussian 09
title: 000228514
version: EM64L-G09RevD.01
frameworkgroup: C1[X(C10H10Cl2O)]
method: RPBEPBE
basis: SDD
operation: Freq
keyword: #p
keyword: freq=noraman
keyword: PBEPBE/SDD
title: #p freq=noraman PBEPBE/SDD
converged: YES YES NO NO
title: Mulliken charges:
elementType: Cl Cl O C C C C C C C C C C H H H H H H H H H H
charge: -0.063109 -0.016581 -0.385735 0.563024 -0.619397 -0.484396 -0.391361 -0.159859 -0.240577 -0.232539 0.447660 -0.167417 -0.735838 0.220053 0.228058 0.261625 0.272426 0.244559 0.219167 0.226034 0.224553 0.225036 0.364612
chargesum: 0.00000
title: Mulliken charges with hydrogens summed into heavy atoms:
elementType: Cl Cl O C C C C C C C C C C
charge: -0.063109 -0.016581 -0.021122 0.563024 -0.171286 -0.222771 -0.118935 0.084701 -0.240577 -0.232539 0.447660 0.051750 -0.060215
polarizability: 1.88994267e+02 1.04627293e+01 1.45245792e+02 -1.03192439e+01 3.89439619e-01 6.84626116e+01
1716.lowfreq: -5.5377 0.0026 0.0032 0.0033 2.4789 5.0113 24.8516 45.8509 97.8496
frequency: 24.8209 45.8459 97.8489 102.9671 166.4168 175.3169 186.1984 199.2875 204.5338 265.5474 284.3982 285.6564 344.1066 352.3605 399.7334 441.3574 490.9790 493.3434 528.3486 549.7889 607.3491 713.0530 742.8675 748.1752 792.3505 866.0895 894.2293 897.6659 904.3196 953.3467 988.0671 1046.1296 1048.0745 1082.0673 1116.2665 1145.4093 1191.9870 1198.0773 1233.1311 1268.9991 1293.4580 1297.8204 1320.6810 1384.9118 1395.4180 1400.7751 1452.4259 1462.0018 1471.6389 1477.0591 1568.7307 1609.2066 1687.4822 2966.5832 2967.3042 3016.6863 3041.7224 3066.9807 3085.0130 3093.1130 3153.9301 3161.1125 3495.0839
redmass: 3.8273 3.8623 2.2675 5.0089 2.8108 7.5979 5.5172 1.6323 4.1578 3.2951 4.9695 3.5621 4.7133 13.5690 6.5129 1.1013 4.0270 3.8805 4.6228 3.9306 3.7991 5.1010 8.6954 2.6369 2.0811 1.5830 1.3936 1.8889 4.6004 1.4728 1.0995 1.5427 3.1994 3.7153 1.9062 1.5546 1.5396 1.4570 1.6856 1.6303 1.4568 1.6626 1.4029 4.0909 1.2560 3.6317 1.1824 1.0476 1.0575 3.1873 6.4518 8.2741 6.1351 1.0584 1.0375 1.1000 1.0970 1.0923 1.0971 1.0905 1.0922 1.0925 1.0648
irintensity: 0.1934 0.0590 0.1205 0.0456 0.7131 0.7489 0.4828 2.2819 0.2987 6.7716 4.8249 4.8672 0.9421 2.3372 3.7703 141.0594 1.0295 1.1107 13.4641 8.1745 10.7494 7.4464 74.3413 16.3925 11.7091 25.5109 0.0734 3.1938 4.9093 38.0527 67.6771 0.3193 0.2797 17.2728 0.1445 183.4855 0.5790 1.8532 95.1321 33.6181 7.3061 10.8267 11.7486 28.4012 13.1987 24.8147 45.6683 12.6870 19.2946 97.5236 41.0884 1.4207 2.1436 30.0338 34.0870 13.8296 24.5535 3.3425 5.6640 65.8899 1.6222 0.1750 65.2581
temp: 298.150 k
press: 1.00000 atm
elementType: 17 17 8 6 6 6 6 6 6 6 6 6 6 1 1 1 1 1 1 1 1 1 1
symmnumber: 1
zpe: 448274.5 jmol-1
zpe.correction: 0.170739 hartree
zpe.thermalcorrener: 0.184314 hartree
zpe.thermalcorrenthalpy: 0.185258 hartree
zpe.thermalcorrgfe: 0.128914 hartree
zpe.sumelectzpe: -1381.428936 hartree
zpe.sumelectthermal: -1381.415361 hartree
zpe.sumelectthermalent: -1381.414417 hartree
zpe.sumelectthermalfe: -1381.470761 hartree
dipole: 3.4270 0.4269 -0.3398
dipole: 3.4702
quadrupole: -90.0589 -87.3042 -90.9444
quadrupole: -4.9946 -0.6231 0.9218
quadrupole: -0.6231 2.1317 -1.5086 -4.9946 -0.6231 0.9218
hfenergy: -1381.5996751 hartree
pointgroup: C01 [X(C10H10Cl2O1)]
dipole: -1.3152178 0.3644646 -0.0367538 debye
dipolederiv: -0.2348358 -0.1168412 0.0569277 -0.1698399 -0.6540277 0.2371066 0.0755375 0.2443539 -0.1533269 -0.4793687 0.3175364 -0.0897286 0.3771826 -0.3938127 0.106018 -0.0998681 0.1031931 -0.072005 -1.2303494 -0.3871076 0.2148142 -0.3917144 -0.2556123 -0.0130488 0.2382113 -0.0077779 -0.3842446 0.2108733 0.0280002 -0.066578 0.0617767 -0.0341859 -0.0082304 -0.2154943 0.0153169 -0.0537325 0.0811048 0.0487126 -0.0348839 0.161863 0.1290851 0.0436408 0.0691828 0.0145738 0.0800009 -0.2355506 -0.0033429 0.0042548 0.102043 -0.0695379 -0.0342023 -0.0304531 -0.027917 -0.1018299 -0.2380929 0.0592349 -0.0188 -0.161281 -0.1709026 0.0452524 0.0877763 0.0290744 -0.1038101 -0.1331947 -0.1134866 0.0230453 -0.2249825 -0.147293 0.0884841 0.2158325 0.0523926 0.1026277 0.0819885 -0.0181143 -0.003429 0.3563438 0.8973376 -0.3987363 -0.1530503 -0.3814018 0.0716575 0.5668816 -0.3996624 0.0947228 -0.7624035 0.5672586 -0.180362 0.2391341 -0.2034422 -0.0082278 0.8979562 0.4301508 -0.2317782 0.479495 -0.2164794 0.0775179 -0.2655357 0.0757879 0.0812704 0.0843233 -0.2034503 0.0649603 -0.2183859 -0.1124083 0.0462161 0.1019014 0.01247 0.1634068 -0.1045267 0.0886693 -0.100565 0.1417154 0.0589587 0.036329 -0.0454826 0.0133362 -0.0012106 -0.0138873 0.054777 -0.027854 -0.0083197 -0.1383934 0.0517572 -0.075721 0.0425945 0.074962 -0.0655991 -0.0041206 0.0881966 0.0057197 0.0626414 -0.0980115 0.0429317 -0.0326619 -0.0823805 0.1071284 -0.0430152 0.021118 -0.0313317 -0.0055615 0.0639114 0.0101829 0.0629841 0.1292207 0.1014666 0.0708468 -0.0110492 0.0980073 0.0597872 0.0303034 -0.0064447 0.0285613 0.1371078 0.1001873 0.0508657 0.0013298 0.080224 0.0995122 -0.0517572 -0.0470349 -0.060255 -0.1138198 0.0928262 0.0464596 -0.0317374 0.0500811 0.1061349 -0.0535613 -0.0285114 -0.0621006 -0.1527655 -0.1776317 -0.0344442 0.0244612 -0.0860525 0.0947815 0.0224067 0.0164727 0.0563563 0.0642028 0.074293 0.0041834 -0.0160664 0.0700756 -0.1547052 0.0325978 -0.0905549 0.0235334 0.0832113 0.081027 0.0409129 0.0745347 0.0183182 0.0611171 -0.1018074 -0.0143462 -0.0528003 -0.1147965 0.4329808 0.0832357 -0.0358957 0.0514657 0.2163055 0.058176 -0.024666 0.0538282 0.3544816 unknown
polarizability: 185.7483925|-17.6276561|138.3151192|-0.8625864|-27.3304328|78.6391591 unknown
InChI: InChI=1S/C10H10Cl2O/c1-2-3-4-7-5-8(11)10(13)9(12)6-7/h2-3,5-6,13H,4H2,1H3
charge 0 multiplicity 1
23 atoms
Cl 1.619702 2.754161 -0.980096
Cl 3.324629 -2.226289 0.785716
O  3.629985 0.54754 -0.3057
C  -0.416702 -0.533336 0.480388
C  -1.858248 -0.928701 0.809513
C  0.65238 -1.430112 0.727959
C  -0.120365 0.748979 -0.046347
C  -2.874591 -0.478746 -0.223434
C  1.212847 1.096372 -0.299572
C  1.981382 -1.05495 0.46319
C  2.302983 0.221957 -0.057619
C  -3.942586 0.318301 0.043432
C  -4.97888 0.755138 -0.966537
H  -1.899433 -2.031214 0.918177
H  -2.140109 -0.508101 1.796079
H  0.45184 -2.428896 1.128867
H  -0.929102 1.455248 -0.256357
H  -2.714715 -0.842382 -1.250016
H  -4.084309 0.67853 1.075404
H  -5.989718 0.408965 -0.675146
H  -5.029371 1.859268 -1.036228
H  -4.757289 0.356824 -1.972204
H  3.687471 1.471042 -0.671169
