program: Gaussian 09
title: 000228510
version: EM64L-G09RevD.01
frameworkgroup: C1[X(C9H5Cl5O2)]
method: RPBEPBE
basis: SDD
operation: Freq
keyword: #p
keyword: freq=noraman
keyword: PBEPBE/SDD
title: #p freq=noraman PBEPBE/SDD
converged: YES YES NO NO
title: Mulliken charges:
elementType: Cl Cl Cl Cl Cl O O C C C C C C C C C H H H H H
charge: 0.054743 0.054645 0.062225 0.062229 0.068178 -0.288472 -0.180068 0.730222 -0.302674 -0.302392 -0.475086 -0.085948 -0.085917 -0.118709 0.264035 -0.655090 0.255298 0.255368 0.232262 0.222330 0.232822
chargesum: 0.00000
title: Mulliken charges with hydrogens summed into heavy atoms:
elementType: Cl Cl Cl Cl Cl O O C C C C C C C C C
charge: 0.054743 0.054645 0.062225 0.062229 0.068178 -0.288472 -0.180068 0.730222 -0.302674 -0.302392 0.035579 -0.085948 -0.085917 -0.118709 0.264035 0.032322
polarizability: 2.05556874e+02 8.77057677e-03 1.81153755e+02 1.11778113e+01 2.73730110e-02 7.83428766e+01
1716.lowfreq: -26.2607 0.0019 0.0023 0.0033 1.9295 4.3184 7.9478 18.8958 40.9429
frequency: -25.2617 18.8279 40.9396 50.2485 67.4213 77.7971 105.7775 179.3296 182.1715 188.7368 200.3012 201.2491 213.5733 229.0455 290.9603 292.2071 315.9843 318.2920 332.2547 354.7238 358.9739 511.8454 515.7956 569.4857 590.9273 611.8823 661.7681 664.3793 712.7664 764.0273 787.2635 807.8075 823.0687 916.9826 993.4237 1034.1734 1065.2832 1086.6967 1099.8340 1229.3197 1242.7178 1327.2222 1335.4308 1338.6440 1357.4471 1402.5512 1438.0170 1474.2471 1480.9261 1534.1320 1544.4652 1706.0227 3000.8516 3003.4575 3047.1950 3102.0244 3105.6706
redmass: 1.8633 9.3265 8.4740 4.0985 31.4376 23.0371 13.6160 11.0563 8.1743 1.1665 29.5705 25.6718 34.0520 7.5206 5.7012 13.2892 17.2095 12.6372 20.6573 11.8025 24.6123 8.5473 2.8033 9.5091 12.0702 13.0354 6.1905 13.8145 12.1359 7.2281 1.3484 8.1656 12.8013 9.2617 3.5375 2.3454 5.9190 1.6028 2.6366 11.9584 1.1688 11.9823 1.8278 12.0049 8.0677 1.2076 1.0809 1.0384 1.0504 11.9963 11.9562 10.6305 1.0561 1.0410 1.0984 1.1004 1.1006
irintensity: 0.4686 0.0117 0.4903 3.0602 0.0499 0.1220 0.2229 0.4526 0.1445 0.4286 0.0423 0.1603 0.0002 0.5509 14.0718 0.7249 0.2241 0.0214 2.3140 2.2918 0.0099 2.9234 0.2615 1.8590 0.0282 11.2566 0.1150 69.1000 29.0413 49.3084 14.5391 51.7225 0.0211 7.3072 400.2381 218.4775 1.1699 0.1832 57.7104 2.4333 0.2685 124.7573 139.2536 35.2273 154.8571 15.7696 35.3744 13.9542 14.4246 0.7113 1.9080 142.1454 26.8287 10.9209 1.1044 24.0447 23.8675
temp: 298.150 k
press: 1.00000 atm
elementType: 17 17 17 17 17 8 8 6 6 6 6 6 6 6 6 6 1 1 1 1 1
symmnumber: 1
zpe: 310470.2 jmol-1
zpe.correction: 0.118252 hartree
zpe.thermalcorrener: 0.134572 hartree
zpe.thermalcorrenthalpy: 0.135516 hartree
zpe.thermalcorrgfe: 0.071283 hartree
zpe.sumelectzpe: -2795.512383 hartree
zpe.sumelectthermal: -2795.496063 hartree
zpe.sumelectthermalent: -2795.495118 hartree
zpe.sumelectthermalfe: -2795.559352 hartree
dipole: -2.4527 -0.0111 -1.4110
dipole: 2.8296
quadrupole: -111.0557 -126.0485 -130.8528
quadrupole: 0.0525 3.9308 -0.0039
quadrupole: 11.5966 -3.3962 -8.2004 0.0525 3.9308 -0.0039
hfenergy: -2795.6306347 hartree
pointgroup: C01 [X(C9H5Cl5O2)]
dipole: 0.9624836 0.0044099 -0.5594219 debye
dipolederiv: -0.2081942 0.2899147 0.0472954 0.2742312 -0.4708162 -0.0603233 0.0352057 -0.055047 0.0031126 -0.2069957 -0.2893785 0.0465564 -0.2735273 -0.4725263 0.0595951 0.0345648 0.0543286 0.0032486 -0.1775504 0.2760457 0.0203166 0.3015411 -0.4960911 -0.0383772 0.0353152 -0.0497409 0.0140624 -0.17595 -0.2751592 0.0198124 -0.3007115 -0.4977074 0.0376808 0.0347745 0.0491081 0.0141945 -0.6624779 -0.0009216 0.1035152 -0.0009691 -0.0014269 0.000127 0.1247342 0.0001648 0.0010139 -2.0881263 -0.0012975 -0.3801701 -0.0022837 -0.2456353 0.0000897 -0.4738809 0.0001929 -0.5953191 -0.623089 -0.000809 0.1588099 -0.0002338 -0.2265303 0.0024873 -0.4342829 0.0012901 -0.8756874 1.0614009 0.0011328 0.0894329 0.0019236 -0.1046565 -0.0000945 -0.281281 -0.0003551 0.0661553 0.1012524 -0.4549634 -0.0967184 -0.5604633 0.5688757 0.1151722 -0.0188571 0.0734477 -0.0293498 0.0987238 0.4539685 -0.0956306 0.5590933 0.5718884 -0.114109 -0.0181146 -0.0724196 -0.0297822 -0.2323282 -0.0020481 0.0786123 -0.007276 0.0929257 0.0033206 0.1730802 0.0019033 -0.0831187 0.0220876 -0.489989 0.0025086 -0.5528132 0.648631 0.0907844 -0.0059751 0.090468 -0.0087189 0.0192472 0.48839 0.0034653 0.5511107 0.6516803 -0.0899328 -0.0049578 -0.0897098 -0.0089683 0.9064711 0.0016844 -0.1600873 0.0017171 -0.2803302 -0.000414 -0.1798493 -0.0004118 -0.0076862 2.0194295 0.0035257 0.1585814 0.0045181 0.1845219 -0.0036882 1.0649626 -0.0017487 1.3567877 -0.0098535 0.000922 -0.0449834 0.000738 0.069294 -0.0001324 0.0222814 0.0007304 0.0234425 0.0548678 0.0302614 -0.0190034 0.0090983 0.0000635 0.1078273 -0.0604977 0.077179 0.0490197 0.0555597 -0.0293943 -0.0208614 -0.0055726 0.0064758 -0.1096065 -0.0623651 -0.0783616 0.0420802 0.1027011 -0.0404304 0.0089188 0.0026706 -0.0582336 0.1056439 -0.0414593 0.0920373 0.0178002 -0.161265 -0.0012794 0.0689744 -0.0018181 0.1092563 0.001625 0.0980594 0.0015091 0.037475 0.1040892 0.0398252 0.0106547 -0.0009734 -0.0496586 -0.1076752 -0.0414572 -0.0945647 0.0102381 unknown
polarizability: 205.454541|0.0088971|181.1537559|-11.7452773|0.0171865|78.4452086 unknown
InChI: InChI=1S/C9H5Cl5O2/c1-2-3(15)16-9-7(13)5(11)4(10)6(12)8(9)14/h2H2,1H3
charge 0 multiplicity 1
21 atoms
Cl 0.449259 -2.753779 -0.460437
Cl 0.441942 2.756928 -0.455808
Cl -2.744812 2.782348 0.135488
Cl -2.737211 -2.788707 0.131437
Cl -4.324963 -0.005545 0.425924
O  1.585323 0.003477 -0.766522
O  2.229135 -0.000986 1.497219
C  0.22138 0.001261 -0.424228
C  -0.473394 -1.221541 -0.291346
C  -0.476717 1.221947 -0.289335
C  3.944242 0.009408 -0.305884
C  -1.86481 1.224998 -0.029981
C  -1.861462 -1.228724 -0.031858
C  -2.558529 -0.002912 0.097816
C  2.562209 0.00332 0.306331
C  5.063944 -0.010787 0.749015
H  4.015246 0.90198 -0.956992
H  4.010995 -0.859962 -0.987746
H  5.000677 -0.913307 1.380272
H  6.049927 -0.000874 0.253425
H  5.000017 0.866259 1.415109
