program: Gaussian 09
title: 000228480
version: EM64L-G09RevD.01
frameworkgroup: C1[X(C13H15NO2)]
method: RPBEPBE
basis: SDD
operation: Freq
keyword: #p
keyword: freq=noraman
keyword: PBEPBE/SDD
title: #p freq=noraman PBEPBE/SDD
converged: YES YES NO NO
title: Mulliken charges:
elementType: O O N C C C C C C C C C C C C C H H H H H H H H H H H H H H H
charge: -0.414201 -0.242116 -0.463667 0.028604 0.163995 0.064039 0.202790 0.368748 0.382619 -0.639857 -0.465160 -0.437566 -0.818519 -0.877325 -0.833229 0.203981 0.310714 0.259252 0.241831 0.219972 0.222412 0.235797 0.280355 0.229305 0.219594 0.228847 0.267734 0.223294 0.223574 0.237465 0.376717
chargesum: 0.00000
title: Mulliken charges with hydrogens summed into heavy atoms:
elementType: O O N C C C C C C C C C C C C C
charge: -0.037484 -0.242116 -0.152953 0.028604 0.163995 0.064039 0.202790 0.368748 0.382619 -0.138774 -0.245188 -0.215153 -0.073062 -0.161149 -0.148897 0.203981
polarizability: 1.92851554e+02 -1.05288766e+01 1.82482607e+02 -1.04341531e+01 -8.18966072e-01 9.28904760e+01
1716.lowfreq: -12.5602 -11.0334 -6.5590 -0.0006 -0.0004 -0.0001 32.6048 47.2555 54.3338
frequency: 32.5560 47.2512 54.2597 71.0268 117.4172 125.3365 135.9149 150.5865 192.4756 218.7486 232.1932 271.0234 286.2801 317.1186 335.7798 359.5456 405.5958 435.5557 494.8367 509.7635 532.5660 545.5288 554.1354 566.5673 583.1859 602.4716 657.3296 665.9594 731.7437 750.3366 773.5543 807.1524 809.3193 840.2004 920.6960 925.0704 954.4204 971.1790 1001.9899 1025.8525 1041.7756 1044.3131 1046.8231 1070.1987 1113.9335 1148.7662 1168.5833 1194.0784 1255.3577 1264.8002 1281.1914 1304.6809 1314.6659 1341.4443 1374.5731 1395.2241 1396.6868 1402.3246 1413.7146 1442.3822 1454.9092 1470.3919 1471.3697 1473.8840 1477.4686 1484.2080 1497.0375 1518.8727 1579.1288 1596.4803 1626.2732 1654.2281 2956.4469 2965.2771 2967.1620 3025.0704 3033.3930 3039.7425 3046.7000 3079.1935 3083.0113 3101.6616 3114.2147 3118.9476 3138.5198 3505.1747 3605.1443
redmass: 5.1885 2.9144 1.3934 4.6194 1.5856 3.4851 1.6175 3.7275 3.2562 1.1009 3.0687 2.7424 4.2390 3.9021 3.1082 4.2349 2.2392 4.9610 3.2007 1.2869 4.2346 4.1643 2.9750 3.0166 3.2527 2.0751 4.7225 2.2947 4.8256 5.0357 6.2003 1.2261 3.7922 6.3184 2.2477 1.3420 1.8423 2.0506 1.6232 1.7970 1.5004 1.4775 1.5265 2.1908 1.9535 3.1382 2.2401 1.3294 1.7767 1.7462 1.3949 2.4047 2.9455 3.0023 3.3592 1.5579 1.3780 1.4644 2.0017 2.4419 1.1833 1.2447 1.0464 1.0930 1.0859 1.0711 1.1113 3.6564 6.2828 6.9690 6.4792 8.1725 1.0387 1.0393 1.0405 1.0977 1.0646 1.0963 1.0943 1.0991 1.0959 1.0958 1.0869 1.0974 1.0958 1.0638 1.0801
irintensity: 2.4300 0.1465 0.0374 1.0463 0.2490 4.3571 0.6494 2.3747 1.4266 0.2709 0.1801 0.6802 3.3962 0.5689 1.0187 0.4507 3.8971 0.2109 14.1352 61.9951 3.7464 38.0063 32.6620 7.7156 4.1748 56.4131 1.5998 105.9968 0.5817 3.5207 0.1481 37.6717 4.7761 26.5483 6.9329 0.0152 4.3033 7.0353 11.8444 50.7317 6.9743 7.2622 7.2867 120.4407 40.0698 13.1372 9.9794 6.6481 7.9012 5.8371 1.7058 20.2672 26.8339 45.8751 31.4815 11.2430 22.7243 2.7079 27.3012 6.7125 38.9288 1.9784 11.4033 13.0266 3.3370 15.3125 17.0694 15.9573 14.7209 0.1805 2.4719 244.4580 55.1103 38.7641 50.8483 27.4289 20.7643 16.9916 19.0081 17.7224 19.7964 3.9577 15.9194 2.2447 33.6934 19.6294 43.8652
temp: 298.150 k
press: 1.00000 atm
elementType: 8 8 7 6 6 6 6 6 6 6 6 6 6 6 6 6 1 1 1 1 1 1 1 1 1 1 1 1 1 1 1
symmnumber: 1
zpe: 658615.7 jmol-1
zpe.correction: 0.250853 hartree
zpe.thermalcorrener: 0.266851 hartree
zpe.thermalcorrenthalpy: 0.267795 hartree
zpe.thermalcorrgfe: 0.206886 hartree
zpe.sumelectzpe: -708.450747 hartree
zpe.sumelectthermal: -708.434750 hartree
zpe.sumelectthermalent: -708.433806 hartree
zpe.sumelectthermalfe: -708.494714 hartree
dipole: -0.9027 -1.4617 -0.0673
dipole: 1.7193
quadrupole: -94.6546 -83.0234 -94.0058
quadrupole: 9.2493 -2.6847 1.9327
quadrupole: -4.0934 7.5379 -3.4445 9.2493 -2.6847 1.9327
hfenergy: -708.7016004 hartree
pointgroup: C01[X(C13H15N1O2)]
dipole: 0.3925361 -0.5506868 0.0144148 debye
polarizability: 191.2286546|11.2970202|183.890985|-11.1522076|1.4562254|93.1049972 unknown
InChI: InChI=1S/C13H15NO2/c1-7-4-5-8(2)13-12(7)10(6-11(15)16)9(3)14-13/h4-5,14-15H,6H2,1-3H3
charge 0 multiplicity 1
31 atoms
O  -3.146256 1.313447 -0.941905
O  -3.824742 -0.898235 -0.762444
N  0.840662 -1.870912 0.029302
C  0.349561 0.346828 0.312061
C  -0.854255 -0.445501 0.546978
C  1.397743 -0.587153 -0.007654
C  -0.5206 -1.794593 0.35728
C  0.65914 1.744979 0.342035
C  2.734084 -0.219304 -0.30195
C  -2.25045 0.032534 0.912884
C  1.989223 2.114002 0.046401
C  3.003116 1.16308 -0.266436
C  -1.363323 -3.03454 0.465745
C  -0.368942 2.811991 0.676412
C  3.789793 -1.257422 -0.632788
C  -3.154862 0.059247 -0.312422
H  1.342803 -2.735109 -0.162581
H  -2.215847 1.035468 1.360257
H  -2.715867 -0.655198 1.639953
H  2.252554 3.178728 0.05825
H  4.018211 1.515158 -0.486603
H  -1.156707 -3.596281 1.398228
H  -2.434038 -2.777269 0.443857
H  -1.180943 -3.720739 -0.383133
H  -0.692022 2.750991 1.734687
H  0.055678 3.819551 0.524518
H  -1.272923 2.723256 0.046827
H  3.938371 -1.974756 0.199278
H  3.521497 -1.845881 -1.533219
H  4.76339 -0.778704 -0.831407
H  -3.699744 1.269543 -1.769013
