program: Gaussian 09
title: 000228463
version: EM64L-G09RevD.01
frameworkgroup: C1[X(C9H9ClN2O2)]
method: RPBEPBE
basis: SDD
operation: Freq
keyword: #p
keyword: freq=noraman
keyword: PBEPBE/SDD
title: #p freq=noraman PBEPBE/SDD
converged: YES YES NO NO
title: Mulliken charges:
elementType: Cl O O N N C C C C C C C C C H H H H H H H H H
charge: -0.056884 -0.405012 -0.263970 -0.429500 0.059096 0.481125 -0.405833 -0.347759 -0.176162 -0.171776 -0.127914 0.018029 -0.791514 0.136744 0.227610 0.295732 0.302254 0.255023 0.256431 0.298503 0.232878 0.231591 0.381309
chargesum: 0.00000
title: Mulliken charges with hydrogens summed into heavy atoms:
elementType: Cl O O N N C C C C C C C C C
charge: -0.056884 -0.023703 -0.263970 -0.127245 0.059096 0.481125 -0.178223 -0.052027 0.078861 0.084654 -0.127914 0.018029 -0.028542 0.136744
polarizability: 2.86578612e+02 -4.30394329e-01 1.25962185e+02 -2.61969585e-03 -2.62365608e-02 5.45927960e+01
1716.lowfreq: 0.0030 0.0033 0.0035 3.5493 7.6277 11.1350 43.6296 50.8722 62.7974
frequency: 43.5998 50.7338 62.7946 80.1106 141.1976 183.0971 185.4502 218.7096 248.5295 282.0221 335.3428 336.1152 412.1577 414.5397 438.9769 443.7342 507.3570 556.4350 574.5580 580.5161 627.6212 641.7417 667.0801 702.2215 714.8103 772.4923 808.8431 840.8147 860.7822 936.3788 974.1548 976.1004 991.1509 1035.9711 1037.5566 1071.1517 1108.6078 1166.8148 1173.9999 1202.1438 1273.2959 1291.0214 1352.6486 1375.5174 1390.5093 1409.0349 1452.3407 1476.9619 1487.7666 1512.5318 1553.9069 1599.6564 1606.4734 1612.2891 2957.9871 3028.2380 3116.4282 3125.5642 3165.2058 3172.8321 3186.8709 3405.9822 3523.1622
redmass: 9.9016 4.1584 8.1135 6.1818 6.5106 1.1765 6.5844 5.5852 3.7918 5.9974 4.2307 4.7688 2.9919 8.3933 2.0456 6.0723 2.8208 5.8054 1.1739 4.8981 7.0901 1.7058 5.7970 3.6934 5.5339 4.3200 1.3699 1.4199 3.8082 1.3495 2.5030 1.3285 3.9321 1.5014 2.5213 2.7564 1.3544 4.0531 1.1397 2.1582 2.1544 1.3365 3.3029 2.7413 1.6068 3.6137 1.2174 2.1878 1.0453 1.9775 6.4564 5.3976 6.8057 6.8167 1.0400 1.0977 1.0944 1.0902 1.0897 1.0952 1.0966 1.0743 1.0640
irintensity: 0.3317 0.0433 0.8838 2.0656 2.1416 3.2225 2.6997 0.1066 3.3800 4.9105 2.7568 0.2033 0.0444 33.0080 4.6739 11.8034 36.3621 13.6785 166.7012 22.1295 2.4921 22.6868 19.2128 0.5149 49.5246 5.6817 37.6422 55.1147 25.3964 0.5119 36.3833 1.6290 24.1670 1.8630 327.4757 62.3361 15.6032 103.3942 25.9995 122.7621 146.3677 6.5228 61.5849 40.4501 45.5583 3.1914 21.1796 251.5006 20.5874 36.3781 533.8002 21.3125 183.1381 161.7451 18.7291 21.0865 0.5523 12.9804 2.2124 3.8582 0.5055 1.8883 46.9050
temp: 298.150 k
press: 1.00000 atm
elementType: 17 8 8 7 7 6 6 6 6 6 6 6 6 6 1 1 1 1 1 1 1 1 1
symmnumber: 1
zpe: 439523.8 jmol-1
zpe.correction: 0.167406 hartree
zpe.thermalcorrener: 0.180785 hartree
zpe.thermalcorrenthalpy: 0.181729 hartree
zpe.thermalcorrgfe: 0.126097 hartree
zpe.sumelectzpe: -1067.331152 hartree
zpe.sumelectthermal: -1067.317773 hartree
zpe.sumelectthermalent: -1067.316829 hartree
zpe.sumelectthermalfe: -1067.372461 hartree
dipole: -0.0073 2.6757 0.0093
dipole: 2.6757
quadrupole: -111.8020 -71.8594 -91.3127
quadrupole: -2.2752 0.0473 0.0089
quadrupole: -20.1439 19.7986 0.3453 -2.2752 0.0473 0.0089
hfenergy: -1067.4985581 hartree
pointgroup: C01 [X(C9H9Cl1N2O2)]
dipole: -0.0642561 1.0412359 0.1410016 debye
dipolederiv: -0.9814662 -0.2030742 -0.0146576 -0.2623965 -0.1867031 -0.0122091 -0.022937 -0.0130905 -0.0681226 -0.1979099 -0.1782693 -0.0267469 0.3751819 -1.2241858 -0.1109926 0.0452477 -0.103037 -0.4190489 -1.6152322 -0.1494727 0.0002515 0.0995033 -0.6095761 -0.0364911 0.0331351 -0.0323746 -0.3439967 -1.788214 -0.1333418 0.0031098 0.9856941 -0.0049348 0.0221198 0.1508518 0.0364827 -0.268033 1.6906077 -0.2459252 -0.0571462 -0.967718 -0.3013147 -0.0185535 -0.1520409 -0.0279463 -0.0622489 1.5001817 0.2710836 0.0172437 0.5039945 0.0430061 -0.0122873 0.0482466 -0.0087066 0.0818536 -0.3228656 -0.0852875 -0.0093881 0.0748099 0.066833 0.0337939 0.0110539 0.0359593 -0.1964674 -0.1481537 -0.0072566 -0.0011193 -0.2393077 -0.052151 0.0169598 -0.0320217 0.014045 -0.1574124 -0.1332585 -0.0383397 -0.0043916 -0.1708865 0.0201717 0.0162176 -0.0211183 0.014362 -0.0861997 -0.267411 -0.0745429 -0.0072557 0.0405989 0.0705643 0.0203385 0.007421 0.0219948 -0.0875972 1.2024222 0.3262157 0.0259232 0.3261157 0.1031537 0.0216502 0.0265337 0.0216677 -0.0922525 -1.6199021 0.3080273 0.0624811 0.5045179 0.2788085 0.0383302 0.0894085 0.0411029 -0.0570027 -0.0507047 -0.0008516 0.0038066 -0.0820388 -0.1846004 -0.0411801 -0.0089812 -0.0429087 0.1290239 2.2072826 0.0249667 -0.0275117 -1.092981 1.4149529 0.1722265 -0.1745921 0.1562767 0.2274599 0.0586188 -0.0856131 -0.0097836 -0.0660147 -0.0806415 -0.0315722 -0.0073191 -0.0313733 0.1656037 0.0759024 0.0590672 0.0087785 0.0663442 0.0736086 -0.013618 0.0095853 -0.0136134 0.1700923 0.0581747 0.0331873 0.0076783 -0.0084249 0.0301021 -0.0364245 0.0015002 -0.0366885 0.300022 0.000421 0.0722501 0.0114111 0.074411 0.0408932 -0.0169129 0.0116324 -0.0168825 0.1621574 0.075113 -0.0364032 -0.0036341 -0.0473914 -0.0272244 -0.0238318 -0.0050452 -0.0240695 0.1577895 -0.0161382 -0.0804694 -0.0068319 0.038838 0.1853014 0.0059735 0.008991 0.0084528 0.1332846 0.0859683 0.0561511 0.1100617 -0.0474642 0.0210062 -0.0431535 0.0216441 -0.0786178 -0.0624997 0.0788369 0.0890049 -0.0974421 -0.0358956 -0.0154385 0.0559999 -0.0373251 0.0877416 -0.0196419 0.1077267 0.0788933 0.0151632 -0.0694901 0.3383685 -0.0063832 -0.0038706 -0.0087768 0.3932367 unknown
polarizability: 286.0400316|9.2568292|125.2844586|-1.9201343|9.1108529|55.8091025 unknown
InChI: InChI=1S/C9H9ClN2O2/c1-6(9(13)14)11-12-8-4-2-7(10)3-5-8/h2-5,12-13H,1H3
charge 0 multiplicity 1
23 atoms
Cl -5.363276 -0.914865 -0.138897
O  3.331411 -1.806417 -0.370409
O  4.980819 -0.180321 -0.186711
N  0.392127 0.923786 0.028686
N  1.414525 0.042384 -0.102439
C  -0.949626 0.47209 -0.013836
C  -1.994835 1.421318 0.121974
C  -1.251985 -0.903351 -0.188515
C  -3.34101 1.00191 0.084367
C  -2.596605 -1.321459 -0.226143
C  -3.625073 -0.366502 -0.089305
C  2.661047 0.501827 -0.059525
C  3.048329 1.953979 0.126026
C  3.75589 -0.48331 -0.205866
H  -1.766807 2.485738 0.257019
H  -0.432722 -1.618781 -0.29171
H  0.563546 1.930579 0.160445
H  -4.151432 1.72879 0.188387
H  -2.840418 -2.379162 -0.360749
H  4.144697 2.042691 0.111491
H  2.685546 2.354928 1.094402
H  2.642346 2.594034 -0.683726
H  4.143706 -2.374786 -0.458266
