program: Gaussian 09
title: 000228462
version: EM64L-G09RevD.01
frameworkgroup: C1[X(C8H10N2O6)]
method: RPBEPBE
basis: SDD
operation: Freq
keyword: #p
keyword: freq=noraman
keyword: PBEPBE/SDD
title: #p freq=noraman PBEPBE/SDD
converged: YES YES NO NO
title: Mulliken charges:
elementType: O O O O O O N N C C C C C C C C H H H H H H H H H H
charge: -0.234474 -0.284467 -0.414210 -0.218521 -0.409528 -0.250205 -0.154893 -0.293774 -0.134705 -0.118520 -0.433415 0.238159 -0.300479 -0.340574 0.221659 0.204598 0.247769 0.298214 0.247718 0.254097 0.305598 0.259765 0.270309 0.276509 0.383971 0.379399
chargesum: 0.00000
title: Mulliken charges with hydrogens summed into heavy atoms:
elementType: O O O O O O N N C C C C C C C C
charge: -0.234474 -0.284467 -0.030239 -0.218521 -0.030128 -0.250205 -0.154893 0.004440 0.113064 0.129199 0.126280 0.238159 -0.040715 0.206244 0.221659 0.204598
polarizability: 1.45875154e+02 3.86487045e+00 1.27916013e+02 2.53927459e+00 1.88174817e+00 8.32162828e+01
1716.lowfreq: -7.7586 -3.7301 0.0009 0.0011 0.0012 6.7149 27.8500 35.2692 42.1966
frequency: 27.8458 35.2063 42.1863 48.7504 64.3398 80.1690 117.4373 141.8256 217.4691 235.8374 271.8766 276.7640 298.9041 324.1883 382.9561 453.4364 462.7461 480.8851 487.5237 513.5117 539.8658 576.9629 597.8245 614.4526 631.8269 633.6497 641.9127 679.4668 753.3616 796.7067 833.7530 838.4982 855.1510 882.5418 958.9047 964.7565 979.9070 994.6560 1019.6431 1039.2473 1056.8128 1076.8942 1126.0361 1143.1938 1211.8969 1222.3432 1251.8220 1259.0961 1260.9216 1295.1613 1344.9667 1350.6653 1357.3035 1367.8047 1391.8639 1417.3326 1424.0653 1459.9385 1568.4879 1658.4520 1660.5289 1685.1873 2993.1900 3006.1270 3011.8122 3050.2351 3102.6438 3149.6367 3181.7772 3376.5801 3508.1442 3519.5890
redmass: 5.9631 6.2230 7.9479 7.9585 7.2979 8.0541 6.6612 5.3221 4.3351 4.1092 3.6991 4.6461 6.5514 3.9188 4.2222 3.9266 2.3597 2.4464 2.2744 4.0498 4.3908 3.7279 5.1317 2.3657 1.9153 2.4736 1.7750 3.5978 4.1785 2.3448 4.4734 5.0989 3.4112 3.6037 2.7314 2.7875 1.3202 2.3958 4.3700 2.6892 2.4584 3.1579 2.9671 1.3383 1.1312 1.8592 1.9057 1.6443 1.6985 1.2857 1.9740 1.5955 1.7578 1.6449 1.6547 1.0822 1.0809 1.3358 8.3356 7.4722 8.2288 8.7039 1.0592 1.0832 1.0650 1.0997 1.0965 1.0882 1.0999 1.0761 1.0641 1.0643
irintensity: 0.1684 0.2340 0.8343 1.7573 3.0458 2.6727 8.1681 2.3511 8.0930 11.3209 3.2950 1.2681 2.2802 19.1320 5.8296 15.8193 20.5993 32.0308 0.4191 22.2776 67.8735 43.9226 10.9451 62.9956 106.7991 68.6570 108.0438 15.9982 29.7893 49.5570 0.5776 6.2603 37.4278 6.0465 12.2428 20.8571 1.9091 47.8722 457.7593 345.2970 32.4210 20.7409 11.3418 32.2310 0.5338 12.0954 27.7331 4.9838 13.6555 1.3340 48.4237 40.2804 11.6868 51.2782 20.8149 44.7132 56.1475 4.8810 191.9870 55.0515 184.3897 200.3616 35.0294 24.3618 23.7682 9.3751 0.9843 3.9991 8.5311 0.9578 23.9590 30.3417
temp: 298.150 k
press: 1.00000 atm
elementType: 8 8 8 8 8 8 7 7 6 6 6 6 6 6 6 6 1 1 1 1 1 1 1 1 1 1
symmnumber: 1
zpe: 492188.3 jmol-1
zpe.correction: 0.187465 hartree
zpe.thermalcorrener: 0.203103 hartree
zpe.thermalcorrenthalpy: 0.204047 hartree
zpe.thermalcorrgfe: 0.141959 hartree
zpe.sumelectzpe: -870.439014 hartree
zpe.sumelectthermal: -870.423376 hartree
zpe.sumelectthermalent: -870.422432 hartree
zpe.sumelectthermalfe: -870.484520 hartree
dipole: 2.3786 1.8850 3.4769
dipole: 4.6151
quadrupole: -98.8380 -79.5715 -91.8204
quadrupole: -1.0273 -3.0306 -1.2695
quadrupole: -8.7614 10.5051 -1.7438 -1.0273 -3.0306 -1.2695
hfenergy: -870.6264791 hartree
pointgroup: C01 [X(C8H10N2O6)]
dipole: -0.9715717 -0.4077001 1.478758 debye
dipolederiv: -0.9825193 -0.0867387 -0.1065082 -0.367998 -0.4786131 -0.0235427 -0.2578001 -0.0617229 -0.3993247 -1.0479519 -0.0589979 0.3212418 0.2725584 -0.5382302 -0.0804691 0.3171603 0.1110168 -0.5279215 -0.3714151 0.1296963 0.0562598 0.2783897 -1.363188 0.3051363 0.0032621 0.2592748 -0.4024294 -0.6960545 0.207118 -0.310957 0.0161432 -0.6792971 -0.0028425 -0.3031403 0.1238929 -0.549267 -1.1428255 -0.4720106 -0.1049715 -0.5182683 -0.6214937 0.0524341 -0.0072546 0.0855839 -0.3299242 -0.7363407 0.0343527 0.1347121 -0.2167571 -0.7896843 -0.2165366 0.006454 -0.3509046 -0.4913026 -0.3436887 -0.0499107 0.0607628 -0.333823 -0.5093082 0.3135943 0.0188337 0.2001221 -0.3738421 -0.3763628 -0.146218 -0.0009675 -0.0492963 -0.5310122 0.3505757 -0.0820483 0.2171264 -0.0997666 0.9464932 -0.0324425 0.2524392 0.1383009 0.4050718 -0.0512812 0.6315207 0.0605893 0.5549075 0.0682724 -0.0728882 -0.0675235 -0.0113656 0.0622846 -0.0714611 -0.0643966 -0.0840022 -0.1522838 -0.1500034 -0.330602 0.0145586 -0.0305601 0.3905821 -0.1152953 -0.0261155 -0.1373069 0.1922444 1.1772018 0.1704681 -0.5189379 -0.1421825 0.7929844 -0.1817789 -0.4605959 -0.294565 0.5495406 -0.1638973 0.1788883 -0.0470982 0.1898476 -0.1473031 -0.0798042 -0.1158266 -0.0404748 -0.1082309 0.4043519 0.1599855 0.0560569 0.413697 0.2220842 -0.1267412 -0.045489 -0.1162094 0.1278963 0.8051851 -0.0803772 0.4626566 -0.1287749 1.6583284 -0.2076089 0.5131774 -0.2643068 0.6140301 1.4382106 0.3351189 -0.1728918 0.5403364 1.0479411 0.3437427 -0.1796453 0.4429222 0.4742345 0.0956971 0.0548477 0.0406976 -0.0049616 0.0334012 -0.0235841 -0.0312728 -0.0563703 -0.0574045 0.0700583 0.0846762 -0.0862527 0.1282247 0.2238913 -0.1628051 -0.0168371 -0.0609601 0.0470638 0.0749136 0.0603309 0.0139267 0.0313996 -0.0657438 0.0580891 0.0069843 0.0407938 0.1433971 0.1419491 -0.0062506 0.017354 -0.0220268 -0.0177373 0.0312938 -0.0303127 0.0600071 -0.0749929 0.098161 0.1175025 0.0032802 -0.018268 0.1423502 -0.0218335 0.0368399 -0.0954715 0.1279584 0.0392789 -0.0696037 0.0617935 -0.0126582 0.0236389 0.0435923 0.0693557 0.0505872 0.1391884 0.0086729 -0.0564853 -0.0398247 -0.0937572 0.1149867 -0.0279073 -0.0338529 -0.0451377 0.0210416 0.1336792 -0.0090953 0.0025252 -0.0852565 0.0437291 0.0542545 0.0569756 0.122927 0.040448 0.2319613 -0.0970318 -0.1303034 -0.0646303 0.3143131 -0.037879 -0.1254725 -0.0588837 0.2728796 0.2769728 0.0356673 0.0879715 0.0916869 0.2660238 -0.1213421 0.1194966 -0.1085273 0.2618601 unknown
polarizability: 145.6185603|-1.5912629|126.9883214|-8.3279002|-3.069369|84.4005681 unknown
InChI: InChI=1S/C8H10N2O6/c11-6-2-1-5(16-4-8(14)15)9-10(6)3-7(12)13/h1-2,5,9,12,14H,3-4H2
charge 0 multiplicity 1
26 atoms
O  -1.146166 1.170035 -0.735743
O  3.504155 0.446692 -0.724532
O  1.288032 -3.633871 0.50018
O  0.079037 -2.104468 -0.768343
O  -4.380425 -0.196928 0.367229
O  -3.304037 1.713986 1.13463
N  1.574355 0.047303 0.526266
N  0.349051 0.511324 1.106818
C  -0.330454 1.616886 0.407464
C  0.636127 2.62581 -0.172777
C  1.920906 -1.350468 0.739619
C  2.412413 0.879297 -0.233487
C  1.918446 2.262809 -0.444344
C  -2.144479 0.15647 -0.425309
C  0.980745 -2.338874 0.057447
C  -3.291407 0.679556 0.430285
H  -0.994362 2.075778 1.166964
H  0.478611 0.719974 2.110258
H  0.256587 3.628451 -0.395278
H  1.963402 -1.602993 1.816136
H  2.938403 -1.488101 0.325629
H  2.642378 2.948858 -0.893321
H  -2.529268 -0.191799 -1.396362
H  -1.678779 -0.709938 0.08162
H  0.708765 -4.293365 0.030887
H  -5.111834 0.135273 0.956064
