program: Gaussian 09
title: 000228461
version: EM64L-G09RevD.01
frameworkgroup: C1[X(C6H8N2O3)]
method: RPBEPBE
basis: SDD
operation: Freq
keyword: #pfreq=noraman
keyword: PBEPBE/SDD
title: #p freq=noraman PBEPBE/SDD
converged: YES YES NO NO
title: Mulliken charges:
elementType: O O O N N C C C C C C H H H H H H H H
charge: -0.495128 -0.297779 -0.278704 -0.105394 -0.329725 -0.361401 -0.297230 0.220062 0.175408 -0.248178 -0.237202 0.256809 0.266734 0.219046 0.224713 0.392438 0.260472 0.260840 0.374218
chargesum: 0.00000
title: Mulliken charges with hydrogens summed into heavy atoms:
elementType: O O O N N C C C C C C
charge: -0.120910 -0.297779 -0.278704 -0.105394 0.062713 0.162143 0.146528 0.220062 0.175408 0.012294 0.023638
polarizability: 1.05030620e+02 6.95607389e+00 1.13603640e+02 3.11647473e+00 -1.01227862e+00 4.76805265e+01
1716.lowfreq: -7.0772 -6.1019 -0.0005 -0.0003 0.0005 8.4626 60.6165 103.1997 109.0938
frequency: 60.5896 103.1971 109.0934 147.8813 234.5736 262.6407 293.7796 313.7370 339.7558 385.5015 425.9283 473.6762 523.5249 569.8796 576.4115 682.8534 710.6633 762.0838 797.4869 845.3359 859.2842 880.4250 961.1912 987.4201 1002.0643 1060.3887 1081.1784 1141.7325 1168.9571 1208.4444 1226.8981 1266.2721 1299.8940 1325.9732 1356.3516 1361.8580 1395.4516 1446.0528 1470.1109 1502.8275 1543.9737 1592.6420 1661.1493 2979.4436 2995.8684 3045.3380 3086.8932 3161.6659 3184.7585 3327.2937 3605.6831
redmass: 3.9015 3.6724 9.2365 4.8519 4.1167 5.4924 4.3373 1.3360 2.8812 4.0449 4.8419 9.6591 2.6275 2.8012 4.7452 4.9564 5.2265 1.3834 4.0835 1.7285 2.7959 3.4383 2.0546 1.2814 3.4479 1.9362 1.9428 1.5372 1.5744 1.1785 2.2093 1.8153 2.7288 1.5040 2.1756 1.4925 1.4371 1.0878 1.1016 2.0092 7.0304 4.9482 6.6174 1.0565 1.0656 1.1075 1.0977 1.0877 1.1002 1.0830 1.0669
irintensity: 1.8431 7.1008 11.7694 7.6365 2.7207 17.6778 0.9296 137.1631 13.2318 31.1251 3.4483 2.6647 8.9465 6.7147 0.2080 7.8026 7.5935 119.8116 10.5330 49.8204 18.5816 11.0820 33.0244 0.1824 44.4930 14.4722 13.9398 47.4391 31.0622 5.1535 75.9957 68.0048 6.7104 2.5535 37.0507 1.0504 8.2711 28.6201 5.1691 6.2226 38.4100 574.7435 30.5214 52.4938 18.3580 53.8473 6.1699 0.1643 5.1658 390.6425 15.7404
temp: 298.150 k
press: 1.00000 atm
elementType: 8 8 8 7 7 6 6 6 6 6 6 1 1 1 1 1 1 1 1
symmnumber: 1
zpe: 375663.8 jmol-1
zpe.correction: 0.143083 hartree
zpe.thermalcorrener: 0.153330 hartree
zpe.thermalcorrenthalpy: 0.154274 hartree
zpe.thermalcorrgfe: 0.107109 hartree
zpe.sumelectzpe: -567.752602 hartree
zpe.sumelectthermal: -567.742355 hartree
zpe.sumelectthermalent: -567.741411 hartree
zpe.sumelectthermalfe: -567.788576 hartree
dipole: 4.3981 0.1531 -1.1947
dipole: 4.5600
quadrupole: -46.8562 -84.8618 -62.9743
quadrupole: -9.9104 -2.9249 3.0821
quadrupole: 18.0412 -19.9644 1.9231 -9.9104 -2.9249 3.0821
hfenergy: -567.8956848 hartree
pointgroup: C01 [X(C6H8N2O3)]
dipole: -1.716394 0.3523678 -0.3852929 debye
dipolederiv: -0.5910729 0.0080601 0.1614041 0.0151083 -0.7977582 -0.0289383 0.1584174 -0.0656355 -0.3868792 -0.6030732 -0.4521691 0.0720302 -0.1439637 -1.1285213 0.0861415 0.060704 0.1392717 -0.4016433 -0.7637336 -0.2630328 0.0869745 -0.5846699 -0.9877593 0.1496669 0.1272298 0.1099913 -0.4177313 -0.6318773 0.5307042 0.0177611 -0.3178259 -0.4128278 0.1273638 -0.0179227 0.0074408 -0.1640763 -0.6486669 -0.3424425 0.1131277 0.6326189 -0.4337191 -0.0950402 0.126983 0.0474214 -0.3200823 0.5742251 -0.2231496 -0.0888881 -0.061173 -0.0518898 0.0614625 -0.0889701 0.0914569 0.2478643 0.3008775 0.1091621 -0.0592731 0.1108299 0.6590861 0.0129547 -0.048245 -0.0078161 0.2635482 0.5333844 0.2875958 -0.0780244 0.2387495 1.4784753 -0.1505771 -0.0823711 -0.1371984 0.2337423 1.0526406 0.6018842 -0.2190078 0.5540335 1.0654576 -0.1492071 -0.2155193 -0.2046071 0.2920245 -0.0772078 -0.1891607 0.0013271 -0.0952103 0.0505614 0.0171384 0.0022902 0.0219187 -0.1162707 0.1248251 0.0151832 -0.0480404 -0.1031086 -0.1767964 0.0255693 -0.0357013 0.0092559 -0.0955415 -0.021624 0.0559718 -0.0260068 0.0722437 0.0654325 -0.1096458 0.0459798 -0.0765727 -0.0731151 0.0899515 0.0053492 -0.004347 -0.1207739 0.0683919 0.0227515 -0.0086612 -0.0068577 0.12817 -0.2056349 -0.0209622 0.0535062 0.0237619 -0.011448 -0.0032562 0.0703827 0.0137748 0.0688812 0.0898438 -0.0233347 0.0403074 -0.0312576 -0.0418684 -0.0571273 -0.0171588 -0.0768768 -0.1331427 0.5148855 -0.1817921 0.0676403 -0.2444142 0.3010708 0.0070127 0.0330422 0.0245906 0.3276294 0.0619983 0.0241632 0.0156856 0.0713225 -0.0136544 -0.0056029 0.0106362 0.0022696 0.1545991 -0.0294814 0.0263671 0.0329374 -0.019421 0.0920455 0.0095576 0.0386837 -0.0022557 0.1493445 0.22974 0.0316026 -0.139114 0.0031499 0.2757215 0.079776 -0.1597997 0.1104281 0.2426791 unknown
polarizability: 108.3611599|7.0182241|108.3379849|-8.9820576|-8.0019215|49.6156422 unknown
InChI: InChI=1S/C6H8N2O3/c9-4-3-8-6(11)2-1-5(10)7-8/h1-2,7,9H,3-4H2
charge 0 multiplicity 1
19 atoms
O  -2.095308 2.070359 -0.195318
O  -0.564345 -2.675662 0.427087
O  2.301689 1.939576 -0.423181
N  -0.434086 -0.347678 0.284174
N  0.330618 0.827215 0.099435
C  -1.833365 -0.154462 0.702874
C  -2.646869 0.697417 -0.275778
C  0.138895 -1.630817 0.227915
C  1.69454 0.844708 -0.20215
C  1.586526 -1.640778 -0.063053
C  2.315726 -0.497131 -0.2464
H  -1.860593 0.321368 1.702634
H  -2.25636 -1.170311 0.780028
H  -3.709092 0.690902 0.038592
H  -2.562388 0.297794 -1.305564
H  -0.250384 1.68167 0.024005
H  2.039756 -2.63563 -0.109112
H  3.390028 -0.515561 -0.453224
H  -2.540591 2.673621 -0.838361
