program: Gaussian 09
title: 000228460
version: EM64L-G09RevD.01
frameworkgroup: C1[X(C7H4ClN3O2)]
method: RPBEPBE
basis: SDD
operation: Freq
keyword: #p
keyword: freq=noraman
keyword: PBEPBE/SDD
title: #p freq=noraman PBEPBE/SDD
converged: NO YES NO YES
title: Mulliken charges:
elementType: Cl O O N N N C C C C C C C H H H H
charge: 0.007156 -0.197568 -0.246273 -0.405573 0.019689 0.023438 0.180636 0.395804 0.348844 -0.361282 -0.361875 -0.418839 -0.211269 0.291511 0.380379 0.289854 0.265368
chargesum: 0.00000
title: Mulliken charges with hydrogens summed into heavy atoms:
elementType: Cl O O N N N C C C C C C C
charge: 0.007156 -0.197568 -0.246273 -0.025195 0.019689 0.023438 0.180636 0.395804 0.348844 -0.361282 -0.070364 -0.128985 0.054099
polarizability: 1.78739455e+02 -4.08500048e+00 1.37990034e+02 3.98994862e-03 -1.69551460e-02 4.24683332e+01
1716.lowfreq: -5.1148 -4.0856 0.0019 0.0022 0.0025 4.1829 84.9635 86.9386 177.2148
frequency: 84.9620 86.9349 177.2148 191.9537 206.4648 211.9227 299.2668 317.0014 393.0896 469.3709 507.2321 527.8908 584.1846 590.2690 620.9970 658.6508 687.8625 728.0808 739.0912 741.8070 830.0082 848.6645 892.2191 940.2014 964.7077 984.2315 1026.3000 1118.0842 1162.0659 1193.7979 1219.3114 1263.4936 1271.4929 1313.1296 1354.0434 1374.3722 1420.0692 1468.7402 1473.0550 1575.3423 1632.6036 3172.1925 3188.8718 3243.8514 3593.2486
redmass: 13.4276 10.6858 14.8018 5.6518 8.3000 6.2250 19.3138 5.8321 9.9897 8.8761 5.7299 6.2075 4.2254 8.6109 8.0071 6.3377 6.8519 1.2963 11.9314 3.1377 1.3684 1.4030 6.5031 5.9915 1.3420 3.9814 5.0851 1.8612 3.1901 1.3771 3.7852 1.9452 4.6893 2.7163 6.9877 7.7533 2.8758 10.0071 3.5533 6.8984 10.2647 1.0889 1.0965 1.0985 1.0830
irintensity: 0.1119 3.3402 3.8251 0.4348 2.2954 1.3369 1.0516 2.1293 1.5636 13.5425 0.0308 7.0331 1.3429 0.7907 0.3877 1.5966 12.4341 74.3739 6.5793 40.4396 48.3400 36.4304 77.0901 6.0571 1.0870 26.7586 22.6641 8.0020 174.6634 14.1363 277.7887 18.9781 54.7285 170.6781 0.7931 83.2710 31.4300 38.1641 9.3754 120.3333 36.5768 1.5533 1.8481 0.7912 106.6607
temp: 298.150 k
press: 1.00000 atm
elementType: 17 8 8 7 7 7 6 6 6 6 6 6 6 1 1 1 1
symmnumber: 1
zpe: 283206.0 jmol-1
zpe.correction: 0.107867 hartree
zpe.thermalcorrener: 0.117828 hartree
zpe.thermalcorrenthalpy: 0.118772 hartree
zpe.thermalcorrgfe: 0.071573 hartree
zpe.sumelectzpe: -1042.908506 hartree
zpe.sumelectthermal: -1042.898545 hartree
zpe.sumelectthermalent: -1042.897601 hartree
zpe.sumelectthermalfe: -1042.944800 hartree
dipole: -2.9385 -1.2571 0.0007
dipole: 3.1961
quadrupole: -93.7669 -79.9998 -81.3111
quadrupole: 3.8593 0.0003 0.0017
quadrupole: -8.7410 5.0262 3.7148 3.8593 0.0003 0.0017
hfenergy: -1043.0163732 hartree
pointgroup: C01 [X(C7H4Cl1N3O2)]
dipole: 1.042088 0.703696 0.0002682 debye
dipolederiv: -0.8410789 -0.2625031 0. -0.1583261 -0.1483765 -0.0000115 0.000022 -0.0000181 -0.0220135 -0.9529415 0.2195347 0.0000764 0.3935772 -0.5608434 -0.0000951 0.0001444 -0.0001242 -0.2227237 -0.6133755 -0.1232291 -0.00001 -0.3714366 -0.776692 -0.000144 -0.0000261 -0.000088 -0.2557366 -0.3934168 -0.1198166 -0.0000144 0.337179 -0.4562796 -0.000034 0.0001128 0.0000471 -0.2081767 0.3512671 -0.0324703 -0.0000811 -0.0699983 -0.3532423 0.0000447 -0.0001398 0.0000051 -0.1881819 2.1242458 0.037541 -0.0000735 0.1616184 1.0626906 0.0002539 -0.000076 0.0002442 0.1998736 0.0277803 0.3566214 0.0000906 -0.2144595 0.3670361 -0.0000384 -0.0000404 -0.0000657 0.0620602 -0.3877912 -0.3726658 -0.0000292 -0.0268243 -0.3410854 -0.0000538 0.000006 -0.0000276 0.0725142 -0.9371702 -0.1397253 0.0000225 -0.4818289 -0.0550632 -0.0000002 -0.0000281 -0.0000344 0.0649037 1.4771432 0.3786378 -0.0000179 -0.1473035 0.5588144 0.0001016 -0.0001017 0.0000864 -0.055747 0.5002253 0.0137162 -0.0000342 0.5505692 -0.0025249 -0.0000125 0.0000679 0.0000347 -0.0981442 0.1000159 -0.0900969 -0.000015 -0.2651947 0.2315705 0.0000827 -0.0000472 0.0000493 -0.1006329 -0.89003 0.0893991 0.000053 0.241025 -0.0382965 -0.0000042 0.0000566 0.0000087 -0.1122972 0.0746 0.0469775 0.0000111 0.01257 0.0921559 -0.0000124 0.0000101 -0.0000179 0.168651 0.2434431 0.0204404 0.0000053 0.0766164 0.3291943 -0.0000276 0.0000232 -0.0000562 0.3490332 0.0408069 0.0165107 0.0000162 -0.0009349 0.093997 -0.0000236 0.0000145 -0.0000191 0.1777388 0.0762766 -0.0388717 0.0000004 -0.0368484 -0.003055 -0.0000254 0.0000017 -0.0000244 0.1688791 unknown
polarizability: 178.8034976|3.7514587|137.9259913|-0.0071155|0.0158986|42.4683332 unknown
InChI: InChI=1S/C7H4ClN3O2/c8-5-1-2-6(11(12)13)7-4(5)3-9-10-7/h1-3,10H
charge 0 multiplicity 1
17 atoms
Cl 3.486687 1.501251 0.000209
O  -3.32828 1.068515 0.000575
O  -2.774005 -1.151381 -0.000035
N  -0.145937 -1.964653 0.000042
N  1.110361 -2.576741 -0.000395
N  -2.461264 0.114849 0.000227
C  -0.065864 -0.590304 0.000104
C  1.340727 -0.278412 0.000051
C  -1.039142 0.442957 0.000294
C  1.729112 1.080126 0.000227
C  -0.613999 1.785575 0.00047
C  2.005209 -1.557368 -0.000207
C  0.766734 2.10777 0.000451
H  -1.371142 2.574646 0.000642
H  -1.005989 -2.513231 0.000185
H  3.071635 -1.769078 -0.000342
H  1.08386 3.153579 0.000604
