program: Gaussian 09
title: 000228452
version: EM64L-G09RevD.01
frameworkgroup: C1[X(C22H16O2)]
method: RPBEPBE
basis: SDD
operation: Freq
keyword: #pfreq=noraman
keyword: PBEPBE/SDD
title: #p freq=noraman PBEPBE/SDD
converged: YES YES NO NO
title: Mulliken charges:
elementType: O O C C C C C C C C C C C C C C C C C C C C C C H H H H H H H H H H H H H H H H
charge: -0.216083 -0.239103 0.209310 0.290730 -0.041842 0.295516 -0.398136 -0.384484 -0.388109 0.078432 0.303722 -0.353685 -0.317180 -0.253949 -0.242515 -0.236252 -0.344452 -0.363846 -0.231002 -0.241948 -0.224778 -0.238297 -0.230497 -0.227140 0.247415 0.299665 0.284803 0.277003 0.260350 0.230310 0.228406 0.230117 0.257088 0.275512 0.235360 0.235072 0.235452 0.232452 0.233072 0.233508
chargesum: 0.00000
title: Mulliken charges with hydrogens summed into heavy atoms:
elementType: O O C C C C C C C C C C C C C C C C C C C C C C
charge: -0.216083 -0.239103 0.209310 0.290730 -0.041842 0.295516 -0.150720 -0.084819 -0.103307 0.078432 0.303722 -0.076681 -0.056830 -0.023639 -0.014109 -0.006134 -0.087364 -0.088333 0.004358 -0.006876 0.010674 -0.005846 0.002575 0.006368
polarizability: 2.90387352e+02 -1.98084301e+01 2.71726215e+02 -1.63742500e+01 -1.39564326e+01 2.12499741e+02
1716.lowfreq: -3.2758 -1.7433 -0.0007 -0.0005 0.0006 5.0988 8.3741 15.3700 33.0862
frequency: 7.2655 15.3303 32.9984 38.7499 47.3447 58.6590 81.4185 115.1451 139.2993 147.8537 168.6477 194.1723 205.8674 248.7114 266.3599 319.1336 335.5587 397.8336 401.4151 402.7146 407.5565 422.5293 434.0407 454.4615 487.4210 511.1300 598.4596 612.6116 613.4880 615.6081 650.1349 672.7188 680.9338 689.1749 699.0149 701.9000 707.5343 736.5704 775.8051 778.0116 788.9827 813.4100 856.4793 860.5154 862.6283 864.6054 897.0192 943.4227 948.4164 952.8585 986.5677 988.8199 989.0217 991.3673 992.0193 995.0015 1003.4410 1007.0493 1009.7591 1012.1461 1018.6391 1027.8904 1039.2090 1056.3098 1084.9971 1085.4205 1095.0030 1173.6101 1173.6504 1175.7071 1180.3569 1185.4026 1190.7530 1208.8273 1231.9900 1253.7555 1315.7064 1316.4249 1333.2766 1370.8087 1384.1877 1388.7487 1389.7297 1433.9390 1435.1250 1435.2607 1474.7398 1476.7507 1482.0526 1528.2121 1544.9012 1571.4453 1585.9490 1589.1662 1597.0806 1606.5709 1607.8828 1608.7298 3086.4006 3126.5697 3128.3347 3130.8171 3136.7293 3140.1733 3141.7425 3147.7296 3152.4841 3156.0872 3158.2792 3161.6675 3169.0108 3169.8417 3171.2657 3179.2073
redmass: 5.9873 5.8744 4.1979 4.1302 4.0734 5.3856 6.3217 6.3105 5.4298 5.6516 5.1193 5.8715 5.8277 5.2553 5.6308 6.2713 7.8697 3.8214 2.9638 2.8359 3.7256 3.9772 4.6774 4.8746 4.8093 4.9922 6.4257 6.4322 6.4407 6.4151 4.5517 4.3201 6.1675 3.4221 1.8570 1.7329 1.6742 2.9570 3.7598 1.9192 2.6599 2.6595 1.8973 1.2424 1.2809 1.4413 2.8188 1.4164 1.4623 1.4373 3.3214 6.1579 4.0694 1.6863 1.5477 1.3900 1.3476 1.5397 1.4830 2.5421 3.0024 2.2979 2.1696 2.6817 1.5864 1.5813 1.7308 1.1025 1.0825 1.0605 1.6072 1.1345 1.4373 1.1546 3.0139 3.9667 1.3360 1.3486 1.4449 3.1423 3.0326 8.7131 3.9209 2.3810 2.2815 2.2584 2.2157 2.2149 2.1654 9.3299 9.4272 5.5185 6.4452 6.4218 7.0313 5.7770 6.1254 6.1532 1.0868 1.0853 1.0851 1.0854 1.0882 1.0901 1.0883 1.0926 1.0925 1.0956 1.0960 1.0962 1.1013 1.0963 1.1011 1.0969
irintensity: 2.2796 0.6868 0.5607 0.4306 0.2757 2.5658 0.5685 1.4682 3.5918 0.7768 2.9069 0.8971 0.7038 4.3797 4.1711 3.2489 6.6511 0.7472 0.3443 0.5991 1.0239 2.8294 1.3563 8.8701 1.9037 11.3876 56.8894 0.6055 0.4347 3.2068 28.6243 1.6933 6.3541 5.3722 43.2223 103.8124 25.6191 44.1375 7.2159 57.2167 47.0861 31.0550 22.8821 5.8617 3.0838 8.6572 20.4852 5.0049 3.6474 5.5786 0.4276 1.6878 2.2907 6.6770 0.5163 0.8360 1.0952 4.5329 9.2681 32.4184 27.0320 6.1112 29.5711 24.3853 5.5031 12.3293 10.0867 15.1629 7.7021 0.5048 59.1836 70.2851 3.1543 29.2425 212.2257 348.5566 0.8803 10.6024 11.9263 2.7588 9.8211 2.1112 5.3350 10.9197 18.9498 21.6363 0.9155 2.4266 22.8179 101.2921 138.7140 49.1175 85.7649 6.0433 161.2909 0.6097 12.3638 9.7302 5.3514 0.4334 1.0085 0.3509 5.2433 20.6111 5.8380 20.3138 11.4787 21.2967 16.9764 19.6904 31.1565 11.7576 20.5761 33.1119
temp: 298.150 k
press: 1.00000 atm
elementType: 8 8 6 6 6 6 6 6 6 6 6 6 6 6 6 6 6 6 6 6 6 6 6 6 1 1 1 1 1 1 1 1 1 1 1 1 1 1 1 1
symmnumber: 1
zpe: 811377.1 jmol-1
zpe.correction: 0.309037 hartree
zpe.thermalcorrener: 0.329020 hartree
zpe.thermalcorrenthalpy: 0.329964 hartree
zpe.thermalcorrgfe: 0.255859 hartree
zpe.sumelectzpe: -996.736125 hartree
zpe.sumelectthermal: -996.716143 hartree
zpe.sumelectthermalent: -996.715199 hartree
zpe.sumelectthermalfe: -996.789304 hartree
dipole: -0.1079 -2.7297 -0.8441
dipole: 2.8593
quadrupole: -119.9381 -123.6992 -137.1601
quadrupole: -0.7725 5.8609 -0.1920
quadrupole: 6.9944 3.2332 -10.2276 -0.7725 5.8609 -0.1920
hfenergy: -997.0451626 hartree
pointgroup: C01 [X(C22H16O2)]
dipole: -0.2177658 0.6560644 0.8874798 debye
polarizability: 276.4295674|-0.4020294|263.1500208|38.3335532|24.3443985|235.0337195 unknown
InChI: InChI=1S/C22H16O2/c23-21(18-12-6-2-7-13-18)16-20(17-10-4-1-5-11-17)22(24)19-14-8-3-9-15-19/h1-16H
charge 0 multiplicity 1
40 atoms
O  -1.423176 1.538393 -2.118075
O  1.555164 -2.025553 0.894519
C  -0.527556 -0.264796 -0.756167
C  -0.700814 -1.47489 -1.605084
C  -1.479481 0.90348 -1.021022
C  -2.461569 1.28557 0.046427
C  0.426604 0.016184 0.199736
C  -0.472286 -2.787763 -1.093835
C  -1.166957 -1.341568 -2.949218
C  1.603784 -0.772194 0.667754
C  2.874642 -0.010678 0.931485
C  -3.221821 2.475125 -0.134109
C  -2.681813 0.484752 1.200387
C  -0.696527 -3.920385 -1.904264
C  -1.376451 -2.478624 -3.754013
C  -1.14677 -3.775217 -3.236083
C  3.093198 1.301509 0.430663
C  3.901952 -0.648402 1.679047
C  -4.174376 2.862622 0.826678
C  -3.643157 0.872222 2.158456
C  -4.387152 2.061267 1.976351
C  4.313887 1.96452 0.680983
C  5.117033 0.016638 1.933609
C  5.325379 1.326769 1.436563
H  0.356679 1.007931 0.670815
H  -0.111021 -2.905565 -0.069911
H  -1.33234 -0.343021 -3.363404
H  -3.045401 3.070764 -1.035995
H  -2.108623 -0.436977 1.341197
H  -0.517528 -4.918922 -1.490431
H  -1.718253 -2.35234 -4.787279
H  -1.317953 -4.658484 -3.861828
H  2.325863 1.793579 -0.176829
H  3.720475 -1.665295 2.042579
H  -4.753224 3.781807 0.685773
H  -3.813391 0.249536 3.043199
H  -5.130748 2.361426 2.723251
H  4.479335 2.972192 0.284572
H  5.901935 -0.479434 2.514851
H  6.271157 1.844323 1.632846
