program: Gaussian 09
title: 000228443
version: EM64L-G09RevD.01
frameworkgroup: C1[X(C12H18O6)]
method: RPBEPBE
basis: SDD
operation: Freq
keyword: #pfreq=noraman
keyword: PBEPBE/SDD
title: #p freq=noraman PBEPBE/SDD
converged: YES YES NO NO
title: Mulliken charges:
elementType: O O O O O O C C C C C C C C C C C C H H H H H H H H H H H H H H H H H H
charge: -0.245143 -0.225137 -0.261816 -0.265452 -0.222555 -0.215653 -0.100246 -0.494229 0.342316 -0.568133 -0.306546 -0.707316 -0.717406 0.172852 0.209702 0.230932 -0.504118 -0.501053 0.283744 0.254443 0.210854 0.262085 0.257919 0.287608 0.227154 0.219933 0.238649 0.207810 0.228362 0.239848 0.240144 0.246236 0.242947 0.246846 0.246505 0.237913
chargesum: 0.00000
title: Mulliken charges with hydrogens summed into heavy atoms:
elementType: O O O O O O C C C C C C C C C C C C
charge: -0.245143 -0.225137 -0.261816 -0.265452 -0.222555 -0.215653 0.183498 -0.028932 0.342316 -0.048129 -0.018937 -0.021579 -0.041386 0.172852 0.209702 0.230932 0.225209 0.230211
polarizability: 1.60649914e+02 -2.41000164e+00 1.58847698e+02 1.58191460e+00 -3.42891534e+00 1.19217770e+02
1716.lowfreq: -6.7029 -0.0005 0.0003 0.0009 7.0832 10.8329 27.3486 35.7655 42.8687
frequency: 27.3334 35.7157 42.8617 61.7327 75.4953 78.0019 84.8113 91.6811 99.7588 111.1139 155.1930 173.8646 186.3882 190.5743 207.8349 230.3927 249.6280 282.1494 290.5843 299.3655 327.7666 348.6172 392.9474 400.9831 437.5068 463.0672 481.7604 514.8706 529.5554 574.4547 586.8611 674.9103 712.8750 740.3469 756.9573 785.1440 817.8790 860.6899 864.2108 896.9066 907.1454 930.1668 964.0481 969.6023 984.8020 992.5717 1039.9982 1072.9558 1092.3198 1113.8794 1114.2693 1121.0121 1130.4524 1149.5404 1150.3499 1161.4829 1186.5787 1193.3799 1212.0792 1244.6808 1259.8168 1275.8165 1287.8955 1303.4681 1317.5301 1342.0606 1361.2916 1382.9000 1398.8296 1422.3814 1423.5332 1436.4584 1446.7719 1453.1603 1454.2997 1459.0832 1462.6630 1463.4545 1466.7176 1471.2480 1487.4548 1633.8540 1646.5819 1656.6376 2978.7597 2983.7970 2991.0973 2996.4825 3007.5636 3008.1870 3022.9805 3039.8082 3067.2702 3072.4588 3089.1340 3095.0523 3099.6807 3104.7229 3110.9769 3111.8496 3155.3962 3155.5633
redmass: 4.9451 4.3934 4.5849 4.1947 1.8723 4.5158 2.4655 1.9138 1.3426 2.4016 3.0630 2.8642 1.5366 2.8267 3.2230 1.4672 3.7275 3.7949 2.7602 4.1419 2.9458 3.3960 7.2902 2.8026 3.0347 3.1420 4.4564 3.9983 3.4765 5.4849 4.8999 5.0655 6.3055 4.6431 6.4444 4.6917 3.1698 3.0063 2.5323 2.4678 6.7815 1.4648 3.6585 2.5388 5.0010 1.3749 1.8799 3.5314 1.9616 1.2856 1.2742 2.6899 3.0532 1.4576 1.4447 1.9606 4.6037 3.2714 1.6685 1.9701 1.9285 1.6107 1.4305 1.4112 1.3773 1.4504 1.5233 1.2301 1.2039 1.1786 1.1782 1.0819 1.0661 1.0496 1.0497 1.0714 1.0514 1.0505 1.0490 1.0684 1.0520 10.1279 11.8964 9.7834 1.0646 1.0666 1.0358 1.0365 1.0295 1.0295 1.0819 1.0837 1.0944 1.0962 1.0994 1.0988 1.1007 1.0997 1.1048 1.1049 1.1049 1.1050
irintensity: 1.3003 1.4567 2.2786 0.7318 0.6387 0.1377 0.5173 0.0799 1.8489 1.8486 6.1348 4.5157 0.5878 1.6787 6.8903 1.0746 0.9914 19.1105 1.2598 19.3496 0.2003 4.2062 5.5809 0.5317 2.1782 1.7728 2.0501 12.3728 0.9710 9.4494 13.6924 15.4799 1.2717 6.7249 2.2449 13.8934 3.7109 10.7459 4.1802 1.5881 53.0403 1.1800 31.8128 15.9415 56.5001 2.7845 15.6182 36.2776 154.1313 1.9628 1.0857 29.9802 178.4173 18.5975 8.5814 80.6980 313.5303 57.0115 61.9131 43.8325 28.3668 47.2544 31.7260 5.8031 15.3559 3.2691 17.3555 28.3202 18.8758 26.6734 11.9695 5.4000 1.2569 14.0386 14.4119 4.1740 16.7430 8.0399 7.5550 6.5248 14.0016 351.2878 328.5196 28.7021 17.7187 5.4686 21.4933 10.2332 31.2456 26.5266 0.8588 6.1150 10.3949 7.8776 14.4300 39.6259 8.8029 39.5515 23.1205 21.1769 11.1862 13.0272
temp: 298.150 k
press: 1.00000 atm
elementType: 8 8 8 8 8 8 6 6 6 6 6 6 6 6 6 6 6 6 1 1 1 1 1 1 1 1 1 1 1 1 1 1 1 1 1 1
symmnumber: 1
zpe: 755314.9 jmol-1
zpe.correction: 0.287684 hartree
zpe.thermalcorrener: 0.308080 hartree
zpe.thermalcorrenthalpy: 0.309024 hartree
zpe.thermalcorrgfe: 0.237071 hartree
zpe.sumelectzpe: -918.020357 hartree
zpe.sumelectthermal: -917.999962 hartree
zpe.sumelectthermalent: -917.999017 hartree
zpe.sumelectthermalfe: -918.070970 hartree
dipole: -4.9611 -4.3833 0.8070
dipole: 6.6691
quadrupole: -107.9109 -109.3197 -107.1340
quadrupole: -12.8881 -6.0583 10.0029
quadrupole: 0.2107 -1.1982 0.9875 -12.8881 -6.0583 10.0029
hfenergy: -918.3080414 hartree
pointgroup: C01 [X(C12H18O6)]
dipole: -1.7979369 -1.818573 0.587096 debye
polarizability: 160.737644|-2.7628145|158.3887259|-3.2009826|-4.0699775|119.5890123 unknown
InChI: InChI=1S/C12H18O6/c1-12(2)6-7(5-8(13)18-12)9(10(14)16-3)11(15)17-4/h7,9H,5-6H2,1-4H3
charge 0 multiplicity 1
36 atoms
O  3.284646 0.518959 -0.296967
O  2.958244 2.768482 -0.376948
O  -2.955513 -1.638596 -0.141803
O  -2.168773 1.196511 1.274459
O  -1.112579 -2.117766 1.196165
O  -2.352586 1.866286 -0.950877
C  0.409861 0.053448 0.045581
C  1.321537 -1.050524 -0.532208
C  2.785221 -0.90298 -0.065205
C  0.92681 1.422857 -0.446827
C  -1.073798 -0.1769 -0.36977
C  2.971515 -1.180744 1.439726
C  3.734607 -1.762856 -0.913133
C  2.441597 1.632215 -0.347192
C  -1.668453 -1.405322 0.332997
C  -1.940311 1.05866 -0.093388
C  -3.677036 -2.781762 0.472033
C  -2.975614 2.375843 1.68005
H  0.443855 0.015739 1.149481
H  0.965244 -2.046814 -0.21815
H  1.289289 -1.007025 -1.64031
H  0.461932 2.265276 0.093735
H  0.663378 1.565062 -1.51521
H  -1.138234 -0.339724 -1.46212
H  2.333966 -0.531166 2.063007
H  2.717269 -2.231192 1.669087
H  4.02174 -0.999653 1.724277
H  3.5062 -2.835313 -0.774715
H  3.636737 -1.515184 -1.98426
H  4.78071 -1.584191 -0.612263
H  -4.664024 -2.779674 -0.009999
H  -3.762191 -2.634066 1.561417
H  -3.137194 -3.722352 0.27188
H  -3.973605 2.328246 1.213601
H  -2.471499 3.30592 1.368718
H  -3.04195 2.305898 2.774234
