program: Gaussian 09
title: 000228437
version: EM64L-G09RevD.01
frameworkgroup: C1[X(C8H12O3)]
method: RPBEPBE
basis: SDD
operation: Freq
keyword: #pfreq=noraman
keyword: PBEPBE/SDD
title: #p freq=noraman PBEPBE/SDD
converged: YES YES NO NO
title: Mulliken charges:
elementType: O O O C C C C C C C C H H H H H H H H H H H H
charge: -0.200768 -0.162882 -0.191219 0.266937 -0.324124 -0.708734 -0.718324 -0.711633 0.106882 0.174981 -0.387917 0.292670 0.260339 0.209926 0.211517 0.214850 0.236567 0.224793 0.212576 0.257271 0.213035 0.269050 0.254211
chargesum: 0.00000
title: Mulliken charges with hydrogens summed into heavy atoms:
elementType: O O O C C C C C C C C
charge: -0.200768 -0.162882 -0.191219 0.266937 -0.031454 -0.026952 -0.042115 -0.028752 0.106882 0.174981 0.135344
polarizability: 9.85843906e+01 5.36252195e+00 9.81966170e+01 -4.95321141e+00 -1.61340056e+00 7.45914819e+01
1716.lowfreq: -7.9364 0.0003 0.0004 0.0008 14.2977 19.3414 51.1644 64.3176 165.5466
frequency: 50.6825 64.2997 165.5394 170.6664 183.2754 210.0612 248.0318 263.5315 291.2694 306.5377 353.9797 397.5675 404.0609 423.0043 504.5829 561.3057 563.8627 611.1142 653.8243 754.1746 810.3311 840.9381 893.6752 930.8405 933.8919 957.4911 965.9236 982.9106 1022.8343 1037.2278 1062.1471 1129.2955 1154.1191 1173.4581 1206.5286 1210.5965 1240.6593 1272.2657 1299.6618 1388.9985 1389.2420 1415.2924 1439.2790 1457.7327 1465.9394 1468.1224 1480.0127 1490.5445 1496.2206 1660.9756 1714.5486 2973.4607 2980.9628 2985.3225 3017.3341 3027.9240 3065.7517 3070.7493 3074.2585 3080.1532 3086.4720 3097.0227 3103.5202
redmass: 3.1806 5.7910 4.2906 2.6165 3.0871 1.3503 1.2018 1.2274 1.9002 2.3468 3.6606 2.5686 3.5159 2.7093 3.8403 5.6489 4.1774 6.2992 8.4096 3.2606 3.8290 3.2431 3.1940 1.7242 1.6614 1.2173 1.8411 9.0007 1.7103 1.5525 3.2674 1.3217 1.2765 5.1082 1.6522 2.1079 2.6265 2.1610 1.3812 1.1914 1.1901 1.2005 1.0733 1.0480 1.0479 1.0478 1.0579 1.0516 1.0558 11.5644 12.5319 1.0361 1.0365 1.0370 1.0583 1.0829 1.1000 1.0997 1.0995 1.0981 1.1057 1.0987 1.0986
irintensity: 0.4366 7.6243 14.1105 1.3147 0.0845 0.3206 0.1362 0.0366 0.1523 3.2540 5.2321 0.0034 5.2667 0.6399 7.8043 7.3755 3.0613 4.7177 2.8901 2.1351 9.0997 30.2916 2.8223 1.3796 0.4530 0.0360 8.9649 66.0991 29.3190 1.5285 63.7477 36.6716 24.1377 182.9794 6.1989 19.5298 5.1334 9.1115 0.9030 27.6756 28.2326 13.5932 22.9236 5.0910 1.0266 0.1830 6.6827 20.4888 24.6608 272.9745 139.4329 26.0715 11.2638 31.6447 13.1964 1.3914 23.1037 2.0537 21.6880 67.9801 3.7621 15.9426 15.2425
temp: 298.150 k
press: 1.00000 atm
elementType: 8 8 8 6 6 6 6 6 6 6 6 1 1 1 1 1 1 1 1 1 1 1 1
symmnumber: 1
zpe: 488889.9 jmol-1
zpe.correction: 0.186208 hartree
zpe.thermalcorrener: 0.197773 hartree
zpe.thermalcorrenthalpy: 0.198717 hartree
zpe.thermalcorrgfe: 0.149246 hartree
zpe.sumelectzpe: -536.856828 hartree
zpe.sumelectthermal: -536.845263 hartree
zpe.sumelectthermalent: -536.844319 hartree
zpe.sumelectthermalfe: -536.893789 hartree
dipole: 1.2568 -1.8915 0.9015
dipole: 2.4434
quadrupole: -62.0838 -83.6648 -63.1187
quadrupole: 5.1179 -0.1673 -1.7601
quadrupole: 7.5386 -14.0423 6.5037 5.1179 -0.1673 -1.7601
hfenergy: -537.043036 hartree
pointgroup: C01 [X(C8H12O3)]
dipole: -0.5143954 -0.7292194 -0.3573803 debye
dipolederiv: -0.836206 0.4018189 0.2553004 0.190757 -0.683073 -0.1373725 0.3310149 -0.2705712 -0.4104594 -0.4182227 -0.0161185 0.0487583 0.0398044 -0.9078547 0.1546829 0.0545315 0.1494861 -0.3449738 -0.5107103 0.0256055 0.0724387 0.1435386 -1.0751086 -0.2213575 0.1043534 -0.1358549 -0.3697149 0.5905857 -0.0443854 0.0897835 0.0094341 0.0782559 -0.0001473 0.2313795 -0.0272479 0.2049641 -0.6594949 0.1371143 0.0366301 0.0449052 -0.464546 0.0103676 0.0562969 -0.0289522 0.0013681 -0.0765347 0.0664534 0.0042241 0.0107145 -0.0652491 -0.0219113 -0.0416436 0.0156958 0.0328179 -0.0387241 -0.0034391 0.006624 -0.0076554 0.0402251 -0.0006922 -0.0038518 0.0031219 -0.1031789 -0.0753659 -0.0482116 0.004966 -0.0205079 -0.0675736 0.0250424 -0.0389731 0.0018344 0.0311384 0.6633232 -0.1168471 -0.2456566 -0.2209676 1.0322283 -0.2131523 -0.3715346 -0.0960119 0.2758325 1.1099574 -0.3047094 -0.4089303 -0.0499877 1.4183277 0.3135755 -0.5490192 0.3203807 0.4543467 -0.04009 -0.1310707 0.2340708 -0.2116065 0.4670388 0.1327155 0.274817 0.1058483 0.1676513 0.123012 -0.0079824 0.049502 -0.000396 0.0451399 -0.0027199 0.0279184 0.0021973 -0.0277892 0.1037225 -0.1015395 0.0373327 -0.0506491 -0.0387014 0.0365946 0.0523661 0.0438026 0.0753842 -0.140489 0.0374803 -0.0853982 -0.0124943 0.0807595 -0.0211562 -0.1093117 -0.009341 0.0403277 0.0891351 0.0140952 0.0202451 0.0105118 0.0715477 0.0220757 0.0592641 -0.0284316 -0.161921 0.0280127 0.1045038 0.0637951 0.1084215 -0.0867303 -0.0701614 0.0393612 -0.0321306 0.0437146 0.0242141 -0.0969308 0.0660029 -0.1031661 -0.0524066 0.0604475 0.0452675 0.024516 0.0542795 -0.1066855 0.0086742 -0.1338168 0.0084361 0.1031933 0.0050087 -0.0845053 0.0041542 0.0321975 -0.1339834 -0.0303688 -0.0868958 0.0123502 0.0871697 0.0211947 -0.11099 0.0049888 0.0369664 0.091376 0.1000505 0.0362463 0.0524755 -0.0535396 -0.0318872 0.0492815 -0.0425358 0.0773226 0.0842434 -0.0153056 0.0242998 -0.0071304 0.0719053 -0.0282581 0.0647589 0.0212773 -0.1608036 0.0014171 0.0479233 -0.0424729 0.0516456 -0.0057553 0.0051822 -0.0910812 0.0423088 0.089137 0.1275075 -0.0268103 -0.0470492 0.0015666 0.0047469 -0.0380715 0.0102997 -0.0685351 -0.038608 unknown
polarizability: 98.3127437|-5.3676815|98.5046425|-4.8128064|1.7551393|74.5551033 unknown
InChI: InChI=1S/C8H12O3/c1-8(2,3)6-5(9)4-11-7(6)10/h6H,4H2,1-3H3
charge 0 multiplicity 1
23 atoms
O  2.063915 0.765952 -0.369435
O  0.684911 -2.418531 0.60368
O  0.710933 2.396736 0.555568
C  -1.394186 0.00292 -0.113328
C  0.005491 -0.012003 0.659781
C  -2.178424 1.27896 0.290708
C  -1.160435 -0.01157 -1.646595
C  -2.207376 -1.246676 0.314084
C  0.881305 -1.216198 0.317846
C  0.892075 1.194425 0.320657
C  2.110924 -0.710186 -0.449862
H  -0.237006 -0.002407 1.739186
H  -1.651128 2.203151 0.003825
H  -3.165359 1.268611 -0.207946
H  -2.350067 1.312972 1.382592
H  -0.651492 -0.93724 -1.976394
H  -0.564947 0.858243 -1.980675
H  -2.13261 0.03168 -2.169733
H  -3.184512 -1.237762 -0.203174
H  -1.69141 -2.18911 0.06659
H  -2.400129 -1.244012 1.402969
H  3.051878 -1.065797 0.00364
H  2.075551 -1.014761 -1.511685
