program: Gaussian 09
title: 000228434
version: EM64L-G09RevD.01
frameworkgroup: C1[X(C6H8O3)]
method: RPBEPBE
basis: SDD
operation: Freq
keyword: #p
keyword: freq=noraman
keyword: PBEPBE/SDD
title: #p freq=noraman PBEPBE/SDD
converged: NO NO NO NO
title: Mulliken charges:
elementType: O O O C C C C C C H H H H H H H H
charge: -0.236787 -0.163906 -0.190550 0.202092 0.144918 -0.614160 -0.674939 -0.674933 0.201980 0.293371 0.293388 0.243866 0.229439 0.236453 0.243884 0.236458 0.229425
chargesum: 0.00000
title: Mulliken charges with hydrogens summed into heavy atoms:
elementType: O O O C C C C C C
charge: -0.236787 -0.163906 -0.190550 0.202092 0.144918 -0.027401 0.034820 0.034834 0.201980
polarizability: 8.70197541e+01 -1.44710569e+00 6.74116638e+01 -1.31723701e-03 -4.06770625e-04 5.44593423e+01
1716.lowfreq: -2.8037 -0.0008 -0.0007 0.0005 13.9301 25.1183 47.5083 91.2257 192.0508
frequency: 46.8745 91.1904 192.0285 196.7520 227.2938 280.9743 302.9282 376.7902 401.2710 473.0029 538.5265 553.8367 577.7279 597.4479 687.7624 794.1804 873.1785 908.8112 939.2624 942.7196 1001.5601 1030.7974 1104.1533 1133.6098 1173.5902 1199.8856 1230.5553 1242.7740 1376.3268 1392.6146 1397.3341 1451.5425 1462.2684 1471.6079 1484.5452 1675.0725 1719.6526 2991.9732 2993.3589 3018.8778 3071.9241 3091.9356 3095.2224 3101.2684 3106.5293
redmass: 3.2481 4.7849 1.0320 3.0644 1.2012 2.6780 2.5400 6.2310 3.9515 2.1434 4.3264 12.2103 3.4324 3.9980 4.6225 3.1331 5.6071 2.5464 2.6160 1.4439 1.3513 4.0494 1.2764 3.5606 3.1253 3.8040 1.7453 2.5705 1.1967 1.1575 1.0990 1.0485 1.0465 1.0633 1.0530 11.9802 12.8367 1.0348 1.0354 1.0621 1.0986 1.1009 1.1003 1.1009 1.1002
irintensity: 15.6749 5.3934 0.1590 0.2028 1.7362 4.2874 0.8186 8.5067 5.9751 0.1343 5.2496 6.6234 2.5264 0.8709 10.2475 10.5516 67.4958 4.4172 34.0393 3.6117 0.5852 38.2896 0.0225 258.4944 89.3740 11.7125 5.5207 2.3346 19.5683 40.9553 17.6664 8.9929 3.2267 10.9791 15.2694 317.1487 188.1316 14.9036 5.9195 2.7897 0.1910 13.3117 24.4430 0.8989 19.7647
temp: 298.150 k
press: 1.00000 atm
elementType: 8 8 8 6 6 6 6 6 6 1 1 1 1 1 1 1 1
symmnumber: 1
zpe: 341064.5 jmol-1
zpe.correction: 0.129905 hartree
zpe.thermalcorrener: 0.139086 hartree
zpe.thermalcorrenthalpy: 0.140030 hartree
zpe.thermalcorrgfe: 0.095623 hartree
zpe.sumelectzpe: -458.421349 hartree
zpe.sumelectthermal: -458.412168 hartree
zpe.sumelectthermalent: -458.411224 hartree
zpe.sumelectthermalfe: -458.455632 hartree
dipole: 2.4594 0.5194 0.0022
dipole: 2.5137
quadrupole: -63.6647 -57.1289 -48.6320
quadrupole: -11.6868 -0.0011 0.0006
quadrupole: -7.1895 -0.6537 7.8432 -11.6868 -0.0011 0.0006
hfenergy: -458.5512541 hartree
pointgroup: C01 [X(C6H8O3)]
dipole: -0.9796541 -0.1353849 -0.0000088 debye
dipolederiv: -1.3327712 0.2703726 -0.0006022 0.5574356 -0.619881 0.000332 -0.0005753 0.0001856 -0.3490748 -0.7052614 -0.2446246 -0.0006062 -0.2416563 -0.6696667 -0.0005083 -0.0006349 -0.0004831 -0.3010836 -1.2911779 0.0216717 -0.0006801 -0.1381057 -0.4861932 -0.0001554 -0.0007367 -0.0000212 -0.3175935 0.748743 0.0066068 0.0002694 0.1995706 -0.1539797 -0.0001872 0.0002787 -0.0004017 0.3767776 0.9550268 0.1022419 0.0010677 -0.0059697 0.9257449 0.0006418 0.0010807 0.0006798 0.0690926 -0.5477303 -0.0235271 -0.0006858 0.1073593 -0.4335421 0.0000147 -0.0006577 -0.0001063 0.1330554 -0.0640988 -0.0179006 -0.0179739 -0.012017 0.0087721 0.0475337 -0.0517785 -0.0384371 -0.0578611 -0.0641341 -0.0179809 0.0179089 -0.012037 0.0087197 -0.0475125 0.0517669 0.0385583 -0.0578017 1.9902568 -0.1092368 0.0012289 -0.4187256 1.1003722 -0.0000308 0.0011929 0.0001195 0.1902184 0.0881714 -0.0138545 -0.0124399 -0.0264664 0.1150342 0.039406 -0.0283517 0.0681665 0.0540302 0.088013 -0.0136863 0.012521 -0.0263931 0.1149957 -0.0394828 0.0284426 -0.0682087 0.0541298 0.1110952 0.021709 -0.0207834 0.0273598 -0.1101318 0.0159165 -0.0151626 -0.0094601 0.0777744 0.0406192 0.0396711 0.1016718 0.0543398 0.0780875 -0.0613782 0.0631622 -0.0406456 -0.0681641 -0.0842679 -0.0414545 -0.0173155 -0.0732014 0.0768977 0.0084164 -0.005554 0.027492 0.0934717 0.1110473 0.0217009 0.0208627 0.0273698 -0.1101104 -0.0161038 0.0152269 0.009241 0.0778049 -0.0843002 -0.0414566 0.0170777 -0.073209 0.0769121 -0.0085175 0.0052842 -0.027556 0.0934621 0.0407691 0.039748 -0.101521 0.0543464 0.0779685 0.0616154 -0.0629838 0.0408771 -0.0682385 unknown
polarizability: 86.7173373|-2.816398|67.7140554|0.0262854|0.0047689|54.4593675 unknown
InChI: InChI=1S/C6H8O3/c1-6(2)4(7)3-5(8)9-6/h3H2,1-2H3
charge 0 multiplicity 1
17 atoms
O  0.631355 1.093003 -0.00011
O  -1.562792 -1.78789 -0.003416
O  2.808205 0.282511 0.001298
C  -0.777573 0.569458 -0.001205
C  -0.613278 -0.978703 -0.001932
C  0.87828 -1.301906 -0.000495
C  -1.471095 1.053905 -1.284598
C  -1.472537 1.052368 1.282017
C  1.591617 0.04937 0.000337
H  1.163433 -1.901919 0.883077
H  1.165249 -1.901871 -0.883498
H  -1.520526 2.15677 -1.28809
H  -0.921093 0.729435 -2.185986
H  -2.496262 0.647648 -1.331061
H  -1.522054 2.155226 1.286741
H  -2.49773 0.645994 1.326881
H  -0.923499 0.726902 2.183638
