program: Gaussian 09
title: 000228433
version: EM64L-G09RevD.01
frameworkgroup: C1[X(C6H8O3)]
method: RPBEPBE
basis: SDD
operation: Freq
keyword: #p
keyword: freq=noraman
keyword: PBEPBE/SDD
title: #p freq=noraman PBEPBE/SDD
converged: YES YES NO NO
title: Mulliken charges:
elementType: O O O C C C C C C H H H H H H H H
charge: -0.205897 -0.162380 -0.190803 -0.302234 -0.376542 0.134140 -0.384193 0.200642 -0.687596 0.292782 0.235760 0.233972 0.262797 0.263071 0.235087 0.222799 0.228596
chargesum: 0.00000
title: Mulliken charges with hydrogens summed into heavy atoms:
elementType: O O O C C C C C C
charge: -0.205897 -0.162380 -0.190803 -0.009452 0.093190 0.134140 0.141675 0.200642 -0.001114
polarizability: 7.68123732e+01 5.17739624e+00 7.19308544e+01 -5.68321223e+00 6.65567540e-01 5.51449528e+01
1716.lowfreq: -12.6599 -0.0006 -0.0003 -0.0002 6.3120 16.5499 43.6515 80.1666 154.7536
frequency: 43.4661 80.1083 154.7486 172.3396 173.8805 264.2706 354.8495 398.6311 499.8112 539.5582 563.9129 626.0120 659.7346 753.6270 763.9751 848.9223 900.3006 943.8993 973.3642 1020.2369 1048.4730 1073.7803 1115.4595 1149.6053 1177.5619 1211.8480 1214.7009 1290.9773 1299.2003 1344.5942 1400.6817 1436.2724 1455.7390 1481.6188 1485.5395 1669.6362 1725.3671 2981.4203 2984.4974 3011.9848 3019.6613 3061.1794 3084.8887 3085.8342 3088.3554
redmass: 5.0648 2.3984 4.2035 2.2130 2.3903 1.4065 7.3761 3.7752 4.2963 7.1865 3.5194 8.3744 5.8321 1.5014 3.2577 2.0890 2.5855 1.7700 9.6652 2.8133 1.6535 3.6370 1.4018 1.2916 2.0390 1.8630 2.1164 1.2417 1.3654 1.3880 1.2136 1.0730 1.0813 1.0502 1.0399 12.2155 12.4972 1.0762 1.0390 1.0614 1.0574 1.1017 1.1008 1.1048 1.1024
irintensity: 9.3472 0.1270 14.2808 1.2675 0.9903 0.6360 10.9219 5.4505 6.1840 4.5178 4.3782 3.6245 1.7272 16.9789 2.9174 23.7398 25.3147 0.5209 67.4118 73.5503 1.7590 13.4756 9.5661 3.0569 42.5429 54.5168 77.7904 0.1405 1.6686 2.2214 16.4529 20.8898 15.2746 6.8736 19.2170 286.2851 138.4877 6.3749 17.0762 21.4938 13.9114 0.4687 30.0246 7.9730 33.5066
temp: 298.150 k
press: 1.00000 atm
elementType: 8 8 8 6 6 6 6 6 6 1 1 1 1 1 1 1 1
symmnumber: 1
zpe: 344731.0 jmol-1
zpe.correction: 0.131301 hartree
zpe.thermalcorrener: 0.140251 hartree
zpe.thermalcorrenthalpy: 0.141196 hartree
zpe.thermalcorrgfe: 0.096718 hartree
zpe.sumelectzpe: -458.409175 hartree
zpe.sumelectthermal: -458.400224 hartree
zpe.sumelectthermalent: -458.399280 hartree
zpe.sumelectthermalfe: -458.443757 hartree
dipole: -0.6560 -1.8596 -0.2396
dipole: 1.9864
quadrupole: -49.7087 -69.3523 -49.2822
quadrupole: -7.5302 -0.5926 -1.8367
quadrupole: 6.4057 -13.2379 6.8322 -7.5302 -0.5926 -1.8367
hfenergy: -458.5404758 hartree
pointgroup: C01 [X(C6H8O3)]
dipole: 0.7590822 0.1700061 -0.0751491 debye
dipolederiv: -0.732877 0.208425 -0.1167559 0.4692181 -0.8248492 0.2463745 -0.2381291 0.3208081 -0.4101311 -0.9150952 -0.059824 0.0514231 -0.122128 -0.4302381 0.0492098 0.0137684 0.0542168 -0.3317855 -1.1028317 0.1948861 -0.1474504 0.1011794 -0.5093978 0.0800414 -0.0477019 0.0911651 -0.3653527 -0.429071 0.0216168 -0.0165279 0.101408 -0.400662 0.1545741 -0.0828403 0.1950661 -0.0319204 0.0619984 0.0019135 -0.0026441 -0.0288036 0.3292903 0.0158659 -0.0017965 0.0748438 0.1155468 1.0462011 -0.0320509 -0.0033879 0.0236786 0.655736 -0.2692693 0.1072348 -0.3269581 0.2701427 0.5041932 -0.2074817 0.1051054 -0.1633203 -0.1062719 0.2144124 0.0553011 0.2510691 0.1947118 1.4839156 -0.1779728 0.1628425 -0.4296806 1.0860347 -0.4221639 0.1999772 -0.5183835 0.4605288 0.0733609 0.0025273 0.0063423 0.0050054 -0.0319886 -0.0406063 0.0071515 -0.0381213 -0.0586409 0.0712987 -0.0010388 0.0013711 0.0016104 0.1109343 -0.0366438 0.0105436 -0.0479625 -0.011409 -0.0251703 0.0904367 -0.0960378 0.0620541 0.013196 0.0156379 -0.0695883 0.0007637 0.0011006 -0.0238746 -0.0970506 0.0965956 -0.0613753 0.0004676 0.0212761 0.0704374 0.0033661 0.0048926 -0.0014862 0.0426279 0.0119938 0.0503889 0.0149526 -0.0509813 0.0497883 -0.0945648 0.0760519 -0.0060979 0.0096461 -0.0418188 -0.0165667 0.123903 -0.0251982 -0.0662521 0.0241407 -0.0276789 -0.048936 -0.0759657 0.0808181 -0.0980154 0.0589361 0.0637922 0.0429741 0.0394956 0.0305406 -0.0680965 0.0678397 -0.0945918 0.0908038 0.0661545 0.0604197 -0.0558933 0.0322464 0.0170853 0.1125683 0.0114655 0.0027227 0.0145431 -0.1561974 -0.0767412 0.005025 -0.0611912 0.0663175 unknown
polarizability: 77.8467287|-4.5092029|71.2150675|2.6172071|-4.5963114|54.8263842 unknown
InChI: InChI=1S/C6H8O3/c1-2-4-5(7)3-9-6(4)8/h4H,2-3H2,1H3
charge 0 multiplicity 1
17 atoms
O  -0.739124 -1.647905 0.461926
O  2.436462 -0.065485 -0.249045
O  -2.387491 -0.206799 -0.309278
C  0.021069 0.339063 -0.703476
C  -0.032061 1.844472 -0.316679
C  1.239136 -0.414222 -0.171149
C  0.741635 -1.699851 0.507276
C  -1.1830 -0.467195 -0.20166
C  -0.074982 2.092419 1.205523
H  0.030052 0.274772 -1.811989
H  -0.928612 2.27993 -0.794412
H  0.85662 2.333183 -0.756705
H  1.086292 -2.602428 -0.028359
H  1.065086 -1.754474 1.561332
H  -0.961776 1.620405 1.666474
H  0.83135 1.706047 1.707244
H  -0.130655 3.175469 1.412876
